Thiophene, 2,3-dichloro-
- Formula: C4H2Cl2S
- Molecular weight: 153.030
- IUPAC Standard InChIKey: LVNVLQIXMBTMPH-UHFFFAOYSA-N
- CAS Registry Number: 17249-79-5
- Chemical structure:
View 3d structure (requires JavaScript / HTML 5) - Other names: 2,3-Dichlorothiophene

Phase change data

Data compiled by: Robert L. Brown and Stephen E. Stein
Quantity | Value | Units | Method | Reference | Comment |
---|---|---|---|---|---|
Tboil | 446.7 | K | N/A | Weast and Grasselli, 1989 |

References

Weast and Grasselli, 1989
CRC Handbook of Data on Organic Compounds, 2nd Editon, Weast,R.C and Grasselli, J.G., ed(s)., CRC Press, Inc., Boca Raton, FL, 1989, 1. [all data]