1,3-Dioxolane, 2,2,4,5-tetramethyl-, cis-
- Formula: C7H14O2
- Molecular weight: 130.1849
- IUPAC Standard InChIKey: IWHKRVPYJLOGAW-OLQVQODUSA-N
- CAS Registry Number: 17226-65-2
- Chemical structure:
View 3d structure (requires JavaScript / HTML 5) - Permanent link for this species. Use this link for bookmarking this species for future reference.

Reaction thermochemistry data

Data compiled by: Hussein Y. Afeefy, Joel F. Liebman, and Stephen E. Stein
Individual Reactions
By formula: C4H10O2 + C3H6O = C7H14O2 + H2O
Quantity | Value | Units | Method | Reference | Comment |
---|---|---|---|---|---|
ΔrH° | -17. | kJ/mol | Eqk | Anteunis and Rommelaere, 1970 | liquid phase |

References

Anteunis and Rommelaere, 1970
Anteunis, M.; Rommelaere, Y.,
NMR experiments on acetals. XXIX. The ease of acetonide formation of some glycols,
Bull. Soc. Chim. Belg., 1970, 79, 523-530. [all data]