Pyrimidine, 2-chloro-
- Formula: C4H3ClN2
- Molecular weight: 114.533
- IUPAC Standard InChIKey: UNCQVRBWJWWJBF-UHFFFAOYSA-N
- CAS Registry Number: 1722-12-9
- Chemical structure:
View 3d structure (requires JavaScript / HTML 5) - Other names: 2-Chloropyrimidine

Phase change data

Data compiled as indicated in comments:
BS - Robert L. Brown and Stephen E. Stein
AC - William E. Acree, Jr., James S. Chickos
Quantity | Value | Units | Method | Reference | Comment |
---|---|---|---|---|---|
ΔsubH° | 70.1 ± 1.3 | kJ/mol | C | Ribeiro da Silva, Amaral, et al., 2007 | AC |
Reduced pressure boiling point
Tboil (K) | Pressure (bar) | Reference | Comment |
---|---|---|---|
348.7 | 0.013 | Aldrich Chemical Company Inc., 1990 | BS |

References

Ribeiro da Silva, Amaral, et al., 2007
Ribeiro da Silva, Manuel A.V.; Amaral, Luísa M.P.F.; Gomes, José R.B.,
Comparative Computational and Experimental Study on the Thermochemistry of the Chloropyrimidines,
J. Phys. Chem. B, 2007, 111, 4, 792-799, https://doi.org/10.1021/jp0664723
. [all data]
Aldrich Chemical Company Inc., 1990
Aldrich Chemical Company Inc.,
Catalog Handbook of Fine Chemicals, Aldrich Chemical Company, Inc., Milwaukee WI, 1990, 1. [all data]
(editor), 1975
(editor), Koptyug V.A.,
Atlas of Spectra of Aromatic and Heterocyclic Compounds, 1975, 8, 20. [all data]