2,4-Dibromodiphenyl ether
- Formula: C12H8Br2O
- Molecular weight: 327.999
- IUPAC Standard InChIKey: JMCIHKKTRDLVCO-UHFFFAOYSA-N
- CAS Registry Number: 171977-44-9
- Chemical structure:
View 3d structure (requires JavaScript / HTML 5) - Permanent link for this species. Use this link for bookmarking this species for future reference.

Phase change data

Data compiled by: William E. Acree, Jr., James S. Chickos
Enthalpy of vaporization
ΔvapH (kJ/mol) | Temperature (K) | Method | Reference | Comment |
---|---|---|---|---|
75.4 | 418. | GC | Wong, Lei, et al., 2001 | Based on data from 363. to 473. K. |

References

Wong, Lei, et al., 2001
Wong, Alexander; Lei, Ying Duan; Alaee, Mehran; Wania, Frank,
Vapor Pressures of the Polybrominated Diphenyl Ethers,
J. Chem. Eng. Data, 2001, 46, 2, 239-242, https://doi.org/10.1021/je0002181
. [all data]