Silane, chloroethenyldimethyl-
- Formula: C4H9ClSi
- Molecular weight: 120.653
- IUPAC Standard InChIKey: XSDCTSITJJJDPY-UHFFFAOYSA-N
- CAS Registry Number: 1719-58-0
- Chemical structure:
View 3d structure (requires JavaScript / HTML 5) - Other names: Dimethylvinylchlorosilane; Vinyldimethylchlorosilane; CV-4720; Chlorodimethylvinylsilane; Silane, dimethyl ethenyl chloro

Phase change data

Data compiled by: Robert L. Brown and Stephen E. Stein
Quantity | Value | Units | Method | Reference | Comment |
---|---|---|---|---|---|
Tboil | 355. | K | N/A | PCR Inc., 1990 |

Normal alkane RI, non-polar column, temperature ramp

Column type | Active phase | I | Reference | Comment |
---|---|---|---|---|
Capillary | OV-101 | 653. | Zenkevich, 2005 | 25. m/0.20 mm/0.10 μm, N2/He, 6. K/min; Tstart: 50. C; Tend: 250. C |

References

PCR Inc., 1990
PCR Inc.,
Research Chemicals Catalog 1990-1991, PCR Inc., Gainesville, FL, 1990, 1. [all data]
Zenkevich, 2005
Zenkevich, I.G.,
Experimentally measured retention indices., 2005. [all data]