Anthracene-D10-
- Formula: C14D10
- Molecular weight: 188.2908
- IUPAC Standard InChIKey: MWPLVEDNUUSJAV-LHNTUAQVSA-N
- CAS Registry Number: 1719-06-8
- Chemical structure:
View 3d structure (requires JavaScript / HTML 5) - Isotopologues:
- Other names: Anthracene. perdeutero-; [2H10]anthracene; Anthracene-d10

Phase change data

Data compiled by: William E. Acree, Jr., James S. Chickos
Quantity | Value | Units | Method | Reference | Comment |
---|---|---|---|---|---|
ΔvapH° | 78.4 | kJ/mol | CGC | Zhao, Unhannanant, et al., 2008 |

Lee's RI, non-polar column, custom temperature program

Column type | Active phase | I | Reference | Comment |
---|---|---|---|---|
Capillary | HP-5 | 301.59 | Reckendorf, 1997 | 25. m/0.2 mm/0.11 μm, He; Program: 106C(0.2min) => 40C/min => 120C => 3C/min => 310C(10min) |

References

Zhao, Unhannanant, et al., 2008
Zhao, Hui; Unhannanant, Patamaporn; Hanshaw, William; Chickos, James S.,
Enthalpies of Vaporization and Vapor Pressures of Some Deuterated Hydrocarbons. Liquid-Vapor Pressure Isotope Effects,
J. Chem. Eng. Data, 2008, 53, 7, 1545-1556, https://doi.org/10.1021/je800091s
. [all data]
Reckendorf, 1997
Reckendorf, R.M.,
Identification of phenyl-substituted polycyclic aromatic compounds in ring furnace gases using GC-MS and GC-AED,
Chromatographia, 1997, 45, 1, 173-182, https://doi.org/10.1007/BF02505557
. [all data]