Chrysene-D12
- Formula: C18D12
- Molecular weight: 240.3618
- IUPAC Standard InChIKey: WDECIBYCCFPHNR-AQZSQYOVSA-N
- CAS Registry Number: 1719-03-5
- Chemical structure:
View 3d structure (requires JavaScript / HTML 5) - Isotopologues:
- Other names: Chrysene, perdeutero-; Chrysene - d12

Phase change data

Data compiled by: William E. Acree, Jr., James S. Chickos
Quantity | Value | Units | Method | Reference | Comment |
---|---|---|---|---|---|
ΔvapH° | 106. | kJ/mol | CGC | Zhao, Unhannanant, et al., 2008 |

References

Zhao, Unhannanant, et al., 2008
Zhao, Hui; Unhannanant, Patamaporn; Hanshaw, William; Chickos, James S.,
Enthalpies of Vaporization and Vapor Pressures of Some Deuterated Hydrocarbons. Liquid-Vapor Pressure Isotope Effects,
J. Chem. Eng. Data, 2008, 53, 7, 1545-1556, https://doi.org/10.1021/je800091s
. [all data]