Benzene, 1,3-dipropyl
- Formula: C12H18
- Molecular weight: 162.2713
- IUPAC Standard InChIKey: GWTBXGSNWKXTPX-UHFFFAOYSA-N
- CAS Registry Number: 17171-72-1
- Chemical structure:
View 3d structure (requires JavaScript / HTML 5) - Other names: 1,3-Dipropylbenzene; 1,3-di-n-propylbenzene

Kovats' RI, non-polar column, isothermal

Column type | Active phase | Temperature (C) | I | Reference | Comment |
---|---|---|---|---|---|
Capillary | OV-101 | 100. | 1209. | Matisová, Kovacicová, et al., 1989 | He; Column length: 50. m; Column diameter: 0.20 mm |
Capillary | OV-101 | 100. | 1209. | Matisová, Rukríglová, et al., 1988 | H2; Column length: 278. m; Column diameter: 0.25 mm |
Capillary | Squalane | 100. | 1196. | Engewald and Wennrich, 1976 | N2; Column length: 100. m; Column diameter: 0.23 mm |

Kovats' RI, non-polar column, custom temperature program

Column type | Active phase | I | Reference | Comment |
---|---|---|---|---|
Capillary | Petrocol DH-100 | 1188.6 | Haagen-Smit Laboratory, 1997 | He; Column length: 100. m; Column diameter: 0.2 mm; Program: 5C(10min) => 5C/min => 50C(48min) => 1.5C/min => 195C(91min) |

Kovats' RI, polar column, isothermal

Column type | Active phase | Temperature (C) | I | Reference | Comment |
---|---|---|---|---|---|
Capillary | Carbowax 20M | 100. | 1429.5 | Engewald and Wennrich, 1976 | N2; Column length: 100. m; Column diameter: 0.23 mm |

Normal alkane RI, non-polar column, temperature ramp

Column type | Active phase | I | Reference | Comment |
---|---|---|---|---|
Capillary | Polydimethyl siloxane: CP-Sil 5 CB | 1190. | Bramston-Cook, 2013 | 60. m/0.25 mm/1.0 μm, Helium, 45. C @ 1.45 min, 3.6 K/min, 210. C @ 2.72 min |

Normal alkane RI, non-polar column, custom temperature program

Column type | Active phase | I | Reference | Comment |
---|---|---|---|---|
Capillary | OV-101 | 1209. | Matisová, Juranyiová, et al., 1991 | 52. m/0.25 mm/0.38 μm, H2; Program: 70 - 160 C at 1.5 deg/min; 160 - 280 C at 15 deg/min 15 min at 280 C |

References

Matisová, Kovacicová, et al., 1989
Matisová, E.; Kovacicová, E.; Ha, P.T.; Kolek, E.; Engewald, W.,
Identification of alkylbenzenes up to C12 by capillary gas chromatography-mass spectrometry. II. Retention indices on OV-101 columns and retention-molecular structure correlations,
J. Chromatogr., 1989, 475, 2, 113-123, https://doi.org/10.1016/S0021-9673(01)89667-9
. [all data]
Matisová, Rukríglová, et al., 1988
Matisová, E.; Rukríglová, M.; Krupcík, J.; Kovacicová, E.; Holotík, S.,
Identification of alkylbenzenes up to C12 by capillary gas chromatography and combined gas chromatography-mass spectrometry. I. OV-101 as stationary phase,
J. Chromatogr., 1988, 455, 301-309, https://doi.org/10.1016/S0021-9673(01)82129-4
. [all data]
Engewald and Wennrich, 1976
Engewald, W.; Wennrich, L.,
Molekülstruktur und Retentionsverhalten. VIII. Zum Retentionsverhalten höherer Alkylbenzole bei der Gas-Verteilungs-Chromatographie,
Chromatographia, 1976, 9, 11, 540-547, https://doi.org/10.1007/BF02275960
. [all data]
Haagen-Smit Laboratory, 1997
Haagen-Smit Laboratory,
Procedure for the detailed hydrocarbon analysis of gasolines by single column high efficiency (capillary) column gas chromatography, SOP NO. MLD 118, Revision No. 1.1, California Environmental Protection Agency, Air Resources Board, El Monte, California, 1997, 22. [all data]
Bramston-Cook, 2013
Bramston-Cook, R.,
Kovats indices for C2-C13 hydrocarbons and selected oxygenated/halocarbons with 100 % dimethylpolysiloxane columns, 2013, retrieved from http://lotusinstruments.com/monographs/List .... [all data]
Matisová, Juranyiová, et al., 1991
Matisová, E.; Juranyiová, E.; Kurán, P.; Brandsteterová, E.; Kocan, A.; Holotík, S.,
Analysis of multicomponent mixtures by high-resolution capillary gas chromatography and combined gas chromatography-mass spectrometry. I. Aromatics in a hydrocarbon matrix,
J. Chromatogr., 1991, 552, 301-312, https://doi.org/10.1016/S0021-9673(01)95946-1
. [all data]