Phosphorus chloride
- Formula: ClP
- Molecular weight: 66.427
- IUPAC Standard InChIKey: OKSUCCKLAIZTQH-UHFFFAOYSA-N
- CAS Registry Number: 17167-55-4
- Chemical structure:
View 3d structure (requires JavaScript / HTML 5) - Permanent link for this species. Use this link for bookmarking this species for future reference.

Gas phase thermochemistry data

Quantity | Value | Units | Method | Reference | Comment |
---|---|---|---|---|---|
ΔfH°gas | 129.00 | kJ/mol | Review | Chase, 1998 | Data last reviewed in December, 1963 |
Quantity | Value | Units | Method | Reference | Comment |
S°gas,1 bar | 237.87 | J/mol*K | Review | Chase, 1998 | Data last reviewed in December, 1963 |
Gas Phase Heat Capacity (Shomate Equation)
Cp° = A + B*t + C*t2 + D*t3 +
E/t2
H° − H°298.15= A*t + B*t2/2 +
C*t3/3 + D*t4/4 − E/t + F − H
S° = A*ln(t) + B*t + C*t2/2 + D*t3/3 −
E/(2*t2) + G
Cp = heat capacity (J/mol*K)
H° = standard enthalpy (kJ/mol)
S° = standard entropy (J/mol*K)
t = temperature (K) / 1000.
View plot Requires a JavaScript / HTML 5 canvas capable browser.
Temperature (K) | 298. to 6000. |
---|---|
A | 37.11898 |
B | 0.651005 |
C | -0.068226 |
D | 0.005817 |
E | -0.234638 |
F | 117.1177 |
G | 281.2769 |
H | 129.0003 |
Reference | Chase, 1998 |
Comment | Data last reviewed in December, 1963 |

Constants of diatomic molecules

Data compiled by: Klaus P. Huber and Gerhard H. Herzberg
Data collected through July, 1977
Symbol | Meaning |
---|---|
State | electronic state and / or symmetry symbol |
Te | minimum electronic energy (cm-1) |
ωe | vibrational constant – first term (cm-1) |
ωexe | vibrational constant – second term (cm-1) |
ωeye | vibrational constant – third term (cm-1) |
Be | rotational constant in equilibrium position (cm-1) |
αe | rotational constant – first term (cm-1) |
γe | rotation-vibration interaction constant (cm-1) |
De | centrifugal distortion constant (cm-1) |
βe | rotational constant – first term, centrifugal force (cm-1) |
re | internuclear distance (Å) |
Trans. | observed transition(s) corresponding to electronic state |
ν00 | position of 0-0 band (units noted in table) |
State | Te | ωe | ωexe | ωeye | Be | αe | γe | De | βe | re | Trans. | ν00 |
---|---|---|---|---|---|---|---|---|---|---|---|---|
B | 41234 | 786 H | 27 1 | B ← X V | 41333 H | |||||||
↳Basco and Yee, 1967 | ||||||||||||
b 1Σ+ | 12087 | 607 H | (3.5) | b → X V | 12102.1 H | |||||||
↳de Bie-Prevot, 1974 | ||||||||||||
X 2Σ-(0+) | 0 | 577 H | 3.5 |

References

Chase, 1998
Chase, M.W., Jr.,
NIST-JANAF Themochemical Tables, Fourth Edition,
J. Phys. Chem. Ref. Data, Monograph 9, 1998, 1-1951. [all data]
Basco and Yee, 1967
Basco, N.; Yee, K.K.,
Spectrum of the PCl free-radical,
Chem. Commun., 1967, 1146. [all data]
de Bie-Prevot, 1974
de Bie-Prevot,
Thesis, Universite Libre de Bruxelles, 1974, 0. [all data]