1-Bromopyrene
- Formula: C16H9Br
- Molecular weight: 281.147
- IUPAC Standard InChIKey: HYGLETVERPVXOS-UHFFFAOYSA-N
- CAS Registry Number: 1714-29-0
- Chemical structure:
View 3d structure (requires JavaScript / HTML 5) - Other names: Pyrene, 1-bromo-

Phase change data

Data compiled as indicated in comments:
TRC - Thermodynamics Research Center, NIST Boulder Laboratories, Chris Muzny director
AC - William E. Acree, Jr., James S. Chickos
Quantity | Value | Units | Method | Reference | Comment |
---|---|---|---|---|---|
Tfus | 368.15 | K | N/A | Mosnaim, Wolf, et al., 1973 | Uncertainty assigned by TRC = 2. K; identified as 3-bromo- in paper; TRC |
Enthalpy of sublimation
ΔsubH (kJ/mol) | Temperature (K) | Method | Reference | Comment |
---|---|---|---|---|
99.2 ± 4.4 | 321. to 368. | ME | Goldfarb and Suuberg, 2008 | AC |

Gas phase ion energetics data

Data compiled by: John E. Bartmess
Electron affinity determinations
EA (eV) | Method | Reference | Comment |
---|---|---|---|
0.72 ± 0.10 | CIDC | Chen and Cooks, 1995 |

References

Mosnaim, Wolf, et al., 1973
Mosnaim, A.D.; Wolf, M.E.; Saavedra, I.; 'Amaro, A.M.; Cardano, G.; Nonhebel, D.C.,
Reaction of Cupric (II) Halides with Organic Compounds VII. Pyrene Some 3-Substituted Pyrenes,
Tetrahedron Lett., 1973, 1973, 1491. [all data]
Goldfarb and Suuberg, 2008
Goldfarb, Jillian L.; Suuberg, Eric M.,
The effect of halogen hetero-atoms on the vapor pressures and thermodynamics of polycyclic aromatic compounds measured via the Knudsen effusion technique,
The Journal of Chemical Thermodynamics, 2008, 40, 3, 460-466, https://doi.org/10.1016/j.jct.2007.09.006
. [all data]
Chen and Cooks, 1995
Chen, G.D.; Cooks, R.G.,
Electron affinities of polycyclic aromatic hydrocarbons determined by the kinetic method,
J. Mass Spectrom., 1995, 30, 8, 1167, https://doi.org/10.1002/jms.1190300814
. [all data]