HCBr radical
- Formula: CHBr
- Molecular weight: 92.923
- IUPAC Standard InChIKey: PRCFIJGWTCBHPP-UHFFFAOYSA-N
- CAS Registry Number: 17141-28-5
- Chemical structure:
View 3d structure (requires JavaScript / HTML 5) - Permanent link for this species. Use this link for bookmarking this species for future reference.

Gas phase ion energetics data

Data compiled by: John E. Bartmess
Electron affinity determinations
EA (eV) | Method | Reference | Comment |
---|---|---|---|
1.4540 ± 0.0050 | LPES | Gilles, Ervin, et al., 1992 | Triplet state is 2.6±2.2 kcal/mol higher in energy than neutral singlet |
1.5560 ± 0.0080 | LPES | Murray, Leopold, et al., 1988 | Singlet-triplet splitting in neutral < 9 kcal/mol |

References

Gilles, Ervin, et al., 1992
Gilles, M.K.; Ervin, K.M.; Ho, J.; Lineberger, W.C.,
Negative Ion Photoelectron Spectroscopy of HCF-, HCCl-, HCBr-, and HCI- - Photoelectron Angular Distributions and Neutral Triplet Excitation,
J. Phys. Chem., 1992, 96, 3, 1130, https://doi.org/10.1021/j100182a021
. [all data]
Murray, Leopold, et al., 1988
Murray, K.K.; Leopold, D.G.; Miller, T.M.; Lineberger, W.C.,
Photoelectron Spectroscopy of the Halocarbene Anions HCF-, HCCl-, HCBr-, HCI-, CF2-, and CCl2-,
J. Chem. Phys., 1988, 89, 9, 5442, https://doi.org/10.1063/1.455596
. [all data]