Styrene, p-methoxy-alpha-methyl-
- Formula: C10H12O
- Molecular weight: 148.2017
- IUPAC Standard InChIKey: XCTSGGVBLWBSIJ-UHFFFAOYSA-N
- CAS Registry Number: 1712-69-2
- Chemical structure:
View 3d structure (requires JavaScript / HTML 5) - Other names: 4-CH3OC6H4C(CH3)=CH2

Phase change data

Data compiled by: William E. Acree, Jr., James S. Chickos
Quantity | Value | Units | Method | Reference | Comment |
---|---|---|---|---|---|
ΔvapH° | 62.1 ± 0.3 | kJ/mol | GS | Verevkin, 1999 | Based on data from 308. to 343. K. |
Quantity | Value | Units | Method | Reference | Comment |
ΔsubH° | 81.2 ± 0.4 | kJ/mol | N/A | Verevkin, 1999 |
Enthalpy of vaporization
ΔvapH (kJ/mol) | Temperature (K) | Method | Reference | Comment |
---|---|---|---|---|
60.6 ± 0.3 | 326. | GS | Verevkin, 1999 | Based on data from 308. to 343. K. |
Enthalpy of fusion
ΔfusH (kJ/mol) | Temperature (K) | Reference |
---|---|---|
19.07 | 309.2 | Verevkin, 1999 |

Gas phase ion energetics data

Data evaluated by: Edward P. Hunter and Sharon G. Lias
Quantity | Value | Units | Method | Reference | Comment |
---|---|---|---|---|---|
Proton affinity (review) | 911.1 | kJ/mol | N/A | Hunter and Lias, 1998 | |
Quantity | Value | Units | Method | Reference | Comment |
Gas basicity | 882.2 | kJ/mol | N/A | Hunter and Lias, 1998 |

References

Verevkin, 1999
Verevkin, Sergey P.,
Thermochemical investigation on α-methyl-styrene and parent phenyl substituted alkenes,
Thermochimica Acta, 1999, 326, 1-2, 17-25, https://doi.org/10.1016/S0040-6031(98)00585-1
. [all data]
Hunter and Lias, 1998
Hunter, E.P.; Lias, S.G.,
Evaluated Gas Phase Basicities and Proton Affinities of Molecules: An Update,
J. Phys. Chem. Ref. Data, 1998, 27, 3, 413-656, https://doi.org/10.1063/1.556018
. [all data]