Nitric acid, 1-methylethyl ester
- Formula: C3H7NO3
- Molecular weight: 105.0926
- IUPAC Standard InChIKey: GAPFWGOSHOCNBM-UHFFFAOYSA-N
- CAS Registry Number: 1712-64-7
- Chemical structure:
View 3d structure (requires JavaScript / HTML 5) - Other names: Isopropyl nitrate; Nitric acid, isopropyl ester; (CH3)2CHONO2; Isopropylester kyseliny dusicne; UN 1222

Phase change data

Data compiled as indicated in comments:
BS - Robert L. Brown and Stephen E. Stein
TRC - Thermodynamics Research Center, NIST Boulder Laboratories, Chris Muzny director
ALS - Hussein Y. Afeefy, Joel F. Liebman, and Stephen E. Stein
AC - William E. Acree, Jr., James S. Chickos
DH - Eugene S. Domalski and Elizabeth D. Hearing
Quantity | Value | Units | Method | Reference | Comment |
---|---|---|---|---|---|
Tboil | 373.7 | K | N/A | Weast and Grasselli, 1989 | BS |
Quantity | Value | Units | Method | Reference | Comment |
Ttriple | 190.81 | K | N/A | Lushnikov, Rubstov, et al., 1988 | Uncertainty assigned by TRC = 0.02 K; TRC |
Quantity | Value | Units | Method | Reference | Comment |
ΔvapH° | 38.79 | kJ/mol | V | Gray and Pratt, 1957 | ALS |
Enthalpy of vaporization
ΔvapH (kJ/mol) | Temperature (K) | Method | Reference | Comment |
---|---|---|---|---|
39.7 | 288. | A | Stephenson and Malanowski, 1987 | Based on data from 273. to 343. K. See also Gray and Pratt, 1957, 2 and Dykyj, 1970.; AC |
Antoine Equation Parameters
log10(P) = A − (B / (T + C))
P = vapor pressure (bar)
T = temperature (K)
View plot Requires a JavaScript / HTML 5 canvas capable browser.
Temperature (K) | A | B | C | Reference | Comment |
---|---|---|---|---|---|
273. to 343. | 3.54496 | 1018.568 | -89.622 | Gray and Pratt, 1957, 3 | Coefficents calculated by NIST from author's data. |
Enthalpy of fusion
ΔfusH (kJ/mol) | Temperature (K) | Reference | Comment |
---|---|---|---|
10.010 | 190.81 | Lushnikov, Rubtsov, et al., 1988 | DH |
10.1 | 190.9 | Lushnikov, Rubstov, et al., 1988 | AC |
Entropy of fusion
ΔfusS (J/mol*K) | Temperature (K) | Reference | Comment |
---|---|---|---|
52.43 | 190.81 | Lushnikov, Rubtsov, et al., 1988 | DH |

Reaction thermochemistry data

Data compiled by: Hussein Y. Afeefy, Joel F. Liebman, and Stephen E. Stein
Individual Reactions
By formula: C3H8O + HNO3 = C3H7NO3 + H2O
Quantity | Value | Units | Method | Reference | Comment |
---|---|---|---|---|---|
ΔrH° | -23.4 | kJ/mol | Eqk | Rubtsov, 1986 | liquid phase |

Van Den Dool and Kratz RI, non-polar column, temperature ramp

Column type | Active phase | I | Reference | Comment |
---|---|---|---|---|
Capillary | DB-1 | 663.8 | Helmig, Pollock, et al., 1996 | 30. m/0.25 mm/1. μm, 6. K/min; Tstart: -50. C; Tend: 180. C |
Capillary | DB-5 | 684.3 | Helmig, Pollock, et al., 1996 | 60. m/0.33 mm/0.25 μm, 6. K/min; Tstart: -50. C; Tend: 180. C |

Normal alkane RI, non-polar column, custom temperature program

Column type | Active phase | I | Reference | Comment |
---|---|---|---|---|
Capillary | SPB-1 | 664. | Flanagan, Streete, et al., 1997 | 60. m/0.53 mm/5. μm, He; Program: 40C(6min) => 5C/min => 80C => 10C/min => 200C |
Capillary | SPB-1 | 664. | Strete, Ruprah, et al., 1992 | 60. m/0.53 mm/5.0 μm, Helium; Program: 40 0C (6 min) 5 0C/min -> 80 0C 10 0C/min -> 200 0C |
Capillary | SPB-1 | 693. | Strete, Ruprah, et al., 1992 | 60. m/0.53 mm/5.0 μm, Helium; Program: not specified |

Condensed phase thermochemistry data

Data compiled as indicated in comments:
ALS - Hussein Y. Afeefy, Joel F. Liebman, and Stephen E. Stein
DH - Eugene S. Domalski and Elizabeth D. Hearing
Quantity | Value | Units | Method | Reference | Comment |
---|---|---|---|---|---|
ΔfH°liquid | -54.9 ± 0.3 | kcal/mol | Ccb | Fairbrother, Skinner, et al., 1957 | ALS |
ΔfH°liquid | -54.02 ± 0.47 | kcal/mol | Ccb | Tavernier and Lamouroux, 1957 | Reanalyzed by Cox and Pilcher, 1970, Original value = -53.05 kcal/mol; Author's hf298_condensed=-54.619 kcal/mol; ALS |
Quantity | Value | Units | Method | Reference | Comment |
ΔcH°liquid | -466.4 ± 0.3 | kcal/mol | Ccb | Fairbrother, Skinner, et al., 1957 | ALS |
ΔcH°liquid | -467.24 ± 0.47 | kcal/mol | Ccb | Tavernier and Lamouroux, 1957 | Reanalyzed by Cox and Pilcher, 1970, Original value = -468.206 kcal/mol; Author's hf298_condensed=-54.619 kcal/mol; ALS |
Quantity | Value | Units | Method | Reference | Comment |
S°liquid | 62.91 | cal/mol*K | N/A | Lushnikov, Rubtsov, et al., 1988 | DH |
Constant pressure heat capacity of liquid
Cp,liquid (cal/mol*K) | Temperature (K) | Reference | Comment |
---|---|---|---|
47.97 | 350. | Bunyan, 1988 | DH |
45.67 | 298.15 | Lushnikov, Rubtsov, et al., 1988 | T = 14 to 300 K.; DH |

References

Weast and Grasselli, 1989
CRC Handbook of Data on Organic Compounds, 2nd Editon, Weast,R.C and Grasselli, J.G., ed(s)., CRC Press, Inc., Boca Raton, FL, 1989, 1. [all data]
Lushnikov, Rubstov, et al., 1988
Lushnikov, V.N.; Rubstov, Y.I.; Dremenko, L.T.; Korolev, A.M.,
Zh. Fiz. Khim., 1988, 62, 1209. [all data]
Gray and Pratt, 1957
Gray, P.; Pratt, M.W.T.,
The latent heats of vaporization of the alkyl nitrates,
J. Chem. Soc., 1957, 2163-21. [all data]
Stephenson and Malanowski, 1987
Stephenson, Richard M.; Malanowski, Stanislaw,
Handbook of the Thermodynamics of Organic Compounds, 1987, https://doi.org/10.1007/978-94-009-3173-2
. [all data]
Gray and Pratt, 1957, 2
Gray, Peter; Pratt, M.W.T.,
414. The latent heats of vaporization of the alkyl nitrates,
J. Chem. Soc., 1957, 2163, https://doi.org/10.1039/jr9570002163
. [all data]
Dykyj, 1970
Dykyj, J.,
Petrochemica, 1970, 10, 2, 51. [all data]
Gray and Pratt, 1957, 3
Gray, P.; Pratt, M.W.T.,
The Latent Heats of Vaporization of the Alkyl Nitrates,
J. Chem. Soc., 1957, 2163-2168, https://doi.org/10.1039/jr9570002163
. [all data]
Lushnikov, Rubtsov, et al., 1988
Lushnikov, V.N.; Rubtsov, Yu.I.; Eremenko, L.T.; Korolev, A.M.,
Specific heat and standard entropy of isopropyl nitrate,
Zhur. Fiz. Khim., 1988, 62, 1209-1214. [all data]
Rubtsov, 1986
Rubtsov, Yu.I.,
Thermodynamic calculation of equilibrium in nitration of alcohols,
Bull. Acad. Sci. USSR, Div. Chem. Sci., 1986, 19-22. [all data]
Helmig, Pollock, et al., 1996
Helmig, D.; Pollock, W.; Greenberg, J.; Zimmerman, P.,
Gas chromatography mass spectrometry analysis of volatile organic trace gases at Mauna Loa Observatory, Hawaii,
J. Geophys. Res., 1996, 101, D9, 14697-14710, https://doi.org/10.1029/96JD00212
. [all data]
Flanagan, Streete, et al., 1997
Flanagan, R.J.; Streete, P.J.; Ramsey, J.D.,
Volatile Substance Abuse, UNODC Technical Series, No 5, United Nations, Office on Drugs and Crime, Vienna International Centre, PO Box 500, A-1400 Vienna, Austria, 1997, 56, retrieved from http://www.odccp.org/pdf/technicalseries1997-01-011.pdf. [all data]
Strete, Ruprah, et al., 1992
Strete, P.J.; Ruprah, M.; Ramsey, J.D.; Flanagan, R.J.,
Detection and identification of volatile substances by headspace capillary gas chromatography to aid the diagnosis of acute poisoning,
Analyst, 1992, 117, 7, 1111-1127, https://doi.org/10.1039/an9921701111
. [all data]