1,1,1',1'-Tetrakis(difluoroamino)-N-1,1'-trifluorodimethylamine
- Formula: C2F11N5
- Molecular weight: 303.0373
- IUPAC Standard InChIKey: SENDPHSDADCUOE-UHFFFAOYSA-N
- CAS Registry Number: 17125-67-6
- Chemical structure:
View 3d structure (requires JavaScript / HTML 5) - Permanent link for this species. Use this link for bookmarking this species for future reference.

Gas phase thermochemistry data

Data compiled by: Hussein Y. Afeefy, Joel F. Liebman, and Stephen E. Stein
Quantity | Value | Units | Method | Reference | Comment |
---|---|---|---|---|---|
ΔfH°gas | -353. | kJ/mol | Cm | Sinke, Thompson, et al., 1967 | Energy of explosion |

Reaction thermochemistry data

Data compiled by: Hussein Y. Afeefy, Joel F. Liebman, and Stephen E. Stein
Individual Reactions
By formula: 2C2F11N5 = 4CF4 + 5N2 + 3F2
Quantity | Value | Units | Method | Reference | Comment |
---|---|---|---|---|---|
ΔrH° | -3009. ± 13. | kJ/mol | Cm | Sinke, Thompson, et al., 1967 | gas phase; Energy of explosion |

References

Sinke, Thompson, et al., 1967
Sinke, G.C.; Thompson, C.J.; Jostad, R.E.; Walker, L.C.; Swanson, A.C.; Stull, D.R.,
Enthalpies of formation and bond energies of some fluoramines,
J. Chem. Phys., 1967, 47, 1852-1854. [all data]