Octafluoromethanetetramine
- Formula: CF8N4
- Molecular weight: 220.0247
- IUPAC Standard InChIKey: PIFUGZAQQQLFAA-UHFFFAOYSA-N
- CAS Registry Number: 17125-65-4
- Chemical structure:
View 3d structure (requires JavaScript / HTML 5) - Other names: Tetrakis(difluoroamino)methane

Gas phase thermochemistry data

Data compiled by: Hussein Y. Afeefy, Joel F. Liebman, and Stephen E. Stein
Quantity | Value | Units | Method | Reference | Comment |
---|---|---|---|---|---|
ΔfH°gas | 1.5 ± 5.6 | kJ/mol | Cm | Sinke, Thompson, et al., 1967 | Reanalyzed by Cox and Pilcher, 1970, Original value = 2. kJ/mol; Energy of explosion |

Reaction thermochemistry data

Data compiled by: Hussein Y. Afeefy, Joel F. Liebman, and Stephen E. Stein
Individual Reactions
By formula: CF8N4 = CF4 + 2N2 + 2F2
Quantity | Value | Units | Method | Reference | Comment |
---|---|---|---|---|---|
ΔrH° | -935.1 | kJ/mol | Cm | Sinke, Thompson, et al., 1967 | gas phase; Energy of explosion |

References

Sinke, Thompson, et al., 1967
Sinke, G.C.; Thompson, C.J.; Jostad, R.E.; Walker, L.C.; Swanson, A.C.; Stull, D.R.,
Enthalpies of formation and bond energies of some fluoramines,
J. Chem. Phys., 1967, 47, 1852-1854. [all data]
Cox and Pilcher, 1970
Cox, J.D.; Pilcher, G.,
Thermochemistry of Organic and Organometallic Compounds, Academic Press, New York, 1970, 1-636. [all data]