3-Bromobenzoyl chloride
- Formula: C7H4BrClO
- Molecular weight: 219.463
- IUPAC Standard InChIKey: PBOOZQFGWNZNQE-UHFFFAOYSA-N
- CAS Registry Number: 1711-09-7
- Chemical structure:
View 3d structure (requires JavaScript / HTML 5) - Other names: m-Bromobenzoyl chloride; Benzoyl chloride, 3-bromo-; Benzoyl chloride, m-bromo-

Phase change data

Data compiled by: Thermodynamics Research Center, NIST Boulder Laboratories, Chris Muzny director
Quantity | Value | Units | Method | Reference | Comment |
---|---|---|---|---|---|
Tboil | 425. | K | N/A | Simons and Ramler, 1943 | Uncertainty assigned by TRC = 6. K |

References

Simons and Ramler, 1943
Simons, J.H.; Ramler, E.O.,
Preparation and Properties of SOme New Trifluoromethyl Compounds,
J. Am. Chem. Soc., 1943, 65, 389. [all data]