Benzoyl chloride, 3-methyl-
- Formula: C8H7ClO
- Molecular weight: 154.594
- IUPAC Standard InChIKey: YHOYYHYBFSYOSQ-UHFFFAOYSA-N
- CAS Registry Number: 1711-06-4
- Chemical structure:
View 3d structure (requires JavaScript / HTML 5) - Other names: m-Toluoyl chloride; m-Methylbenzoyl chloride; m-Toluyl chloride; meta Methyl benzoyl chloride; Toluoyl chloride; 3-Methylbenzoyl chloride; 3-Toluoyl chloride

Phase change data

Data compiled by: Robert L. Brown and Stephen E. Stein
Reduced pressure boiling point
Tboil (K) | Pressure (bar) | Reference |
---|---|---|
359.2 | 0.007 | Aldrich Chemical Company Inc., 1990 |
369. to 371. | 0.016 | Frinton Laboratories Inc., 1986 |

References

Aldrich Chemical Company Inc., 1990
Aldrich Chemical Company Inc.,
Catalog Handbook of Fine Chemicals, Aldrich Chemical Company, Inc., Milwaukee WI, 1990, 1. [all data]
Frinton Laboratories Inc., 1986
Frinton Laboratories Inc.,
Catalog Number 11, Frinton Laboratories Inc., Vineland, NJ, 1986, 99. [all data]