(E,E)-hexa-2,4-dien-1-ol
- Formula: C6H10O
- Molecular weight: 98.1430
- IUPAC Standard InChIKey: MEIRRNXMZYDVDW-MQQKCMAXSA-N
- CAS Registry Number: 17102-64-6
- Chemical structure:
View 3d structure (requires JavaScript / HTML 5) - Stereoisomers:
- Other names: 2,4-Hexadien-1-ol, (E,E)-

Phase change data

Data compiled by: Robert L. Brown and Stephen E. Stein
Reduced pressure boiling point
Tboil (K) | Pressure (bar) | Reference |
---|---|---|
353.2 | 0.016 | Aldrich Chemical Company Inc., 1990 |
353. | 0.016 | Farchan Laboratories, 1990 |
349.2 | 0.016 | Weast and Grasselli, 1989 |

References

Aldrich Chemical Company Inc., 1990
Aldrich Chemical Company Inc.,
Catalog Handbook of Fine Chemicals, Aldrich Chemical Company, Inc., Milwaukee WI, 1990, 1. [all data]
Farchan Laboratories, 1990
Farchan Laboratories,
Research Chemicals Catalog, Farchan Laboratories, Gainesville, FL, 1990, 91. [all data]
Weast and Grasselli, 1989
CRC Handbook of Data on Organic Compounds, 2nd Editon, Weast,R.C and Grasselli, J.G., ed(s)., CRC Press, Inc., Boca Raton, FL, 1989, 1. [all data]