2-(methylnitroamino)ethyl nitrate
- Formula: C3H7N3O5
- Molecular weight: 165.1048
- IUPAC Standard InChIKey: XYKVWCZODOKFIK-UHFFFAOYSA-N
- CAS Registry Number: 17096-47-8
- Chemical structure:
View 3d structure (requires JavaScript / HTML 5) - Other names: 2-(Methylnitroamino)ethanol nitrate

Condensed phase thermochemistry data

Data compiled by: Hussein Y. Afeefy, Joel F. Liebman, and Stephen E. Stein
Quantity | Value | Units | Method | Reference | Comment |
---|---|---|---|---|---|
ΔfH°solid | -149.81 | kJ/mol | Ccb | Simmons, 1994 | |
ΔfH°solid | -186.1 | kJ/mol | Ccb | Medard and Thomas, 1957 | Heat of combustion corrected for pressure |
Quantity | Value | Units | Method | Reference | Comment |
ΔcH°solid | -2031.2 | kJ/mol | Ccb | Simmons, 1994 | |
ΔcH°solid | -1994.8 | kJ/mol | Ccb | Medard and Thomas, 1957 | Heat of combustion corrected for pressure |
ΔcH°solid | -1982. | kJ/mol | Ccb | Handrick, 1956 | Stegeman, G. Univ. of Pittsburg 1945 |

References

Simmons, 1994
Simmons, R.L.,
Thermochemistry of NENA plasticizers,
Int. Annu. Conf. ICT, 25th, 1994, 1-10. [all data]
Medard and Thomas, 1957
Medard, L.; Thomas, M.,
Chaleur de combustion de onze substances explosives ou apparentees a des explosifs,
Mem. Poudres, 1957, 39, 195-208. [all data]
Handrick, 1956
Handrick, G.R.,
Report of the study of pure explosive compounds. Part IV. Calculation of heat of combustion of organic compounds from structural features and calculation of power of high explosives, Rpt. C-58247 for the Office of the Chief of Ordnance, contract DA-19-020-ORD-47 by the Arthur D. Little, Inc., Cambridge, MA, 1956, 467-573. [all data]