1,4,9,10-Anthracenetetrone

Phase change data

Data compiled as indicated in comments:
ALS - Hussein Y. Afeefy, Joel F. Liebman, and Stephen E. Stein
DRB - Donald R. Burgess, Jr.

Quantity Value Units Method Reference Comment
Δsub124. ± 2.kJ/molERibeiro Da Silva, Ribeiro Da Silva, et al., 1989ALS
Δsub124.0kJ/molN/ARibeiro Da Silva, Ribeiro Da Silva, et al., 1989DRB

References

Ribeiro Da Silva, Ribeiro Da Silva, et al., 1989
Ribeiro Da Silva, M.A.V.; Ribeiro Da Silva, D.M.C.; Teixeira, J.A.S., Enthalpies of combustion of 1,4-naphthoquinone, 9,10-anthraquinone, 9,10-phenanthraquinone, 1,4,9,10-anthradiquinone, 5,8-dihydroxy-1,4-naphthoquinone, and 1,4-dihydroxy-9,10-anthraquinone, J. Chem. Thermodyn., 1989, 21, 265-274. [all data]