1-Methyl-7-oxabicyclo[4.1.0]hepta-2,4-diene
- Formula: C7H8O
- Molecular weight: 108.1378
- IUPAC Standard InChIKey: FHYLEJSGUQBKRQ-UHFFFAOYSA-N
- CAS Registry Number: 17091-93-9
- Chemical structure:
View 3d structure (requires JavaScript / HTML 5) - Permanent link for this species. Use this link for bookmarking this species for future reference.

Reaction thermochemistry data

Data compiled by: Hussein Y. Afeefy, Joel F. Liebman, and Stephen E. Stein
Individual Reactions
By formula: C7H8O = C7H8O
Quantity | Value | Units | Method | Reference | Comment |
---|---|---|---|---|---|
ΔrH° | 0.5 ± 1.0 | kcal/mol | Eqk | Reich, Ciganek, et al., 1970 | liquid phase |

References

Reich, Ciganek, et al., 1970
Reich, H.J.; Ciganek, E.; Roberts, J.D.,
Nuclear magnetic resonance spectroscopy. Kinetics of a 7,7-dicyanonorcaradiene valence tautomerism,
J. Am. Chem. Soc., 1970, 92, 5166-5169. [all data]