Dioxybismethanol
- Formula: C2H6O4
- Molecular weight: 94.0666
- IUPAC Standard InChIKey: JLJXMZMKMRQOLN-UHFFFAOYSA-N
- CAS Registry Number: 17088-73-2
- Chemical structure:
View 3d structure (requires JavaScript / HTML 5) - Permanent link for this species. Use this link for bookmarking this species for future reference.

Gas phase thermochemistry data

Data compiled as indicated in comments:
ALS - Hussein Y. Afeefy, Joel F. Liebman, and Stephen E. Stein
Quantity | Value | Units | Method | Reference | Comment |
---|---|---|---|---|---|
ΔfH°gas | -520.9 | kJ/mol | Semi | Stewart, 2004 | |
ΔfH°gas | -571.7 ± 6.7 | kJ/mol | Cm | Jenkins and Style, 1953 | Reanalyzed by Cox and Pilcher, 1970, Original value = -559.8 kJ/mol; ALS |

Condensed phase thermochemistry data

Data compiled by: Hussein Y. Afeefy, Joel F. Liebman, and Stephen E. Stein
Quantity | Value | Units | Method | Reference | Comment |
---|---|---|---|---|---|
ΔfH°solid | -665.8 ± 5.1 | kJ/mol | Cm | Jenkins and Style, 1953 | Reanalyzed by Cox and Pilcher, 1970, Original value = -654.0 kJ/mol |

Phase change data

Data compiled as indicated in comments:
ALS - Hussein Y. Afeefy, Joel F. Liebman, and Stephen E. Stein
DRB - Donald R. Burgess, Jr.
Quantity | Value | Units | Method | Reference | Comment |
---|---|---|---|---|---|
ΔsubH° | 94.1 | kJ/mol | V | Jenkins and Style, 1953 | ALS |
ΔsubH° | 94.1 | kJ/mol | N/A | Jenkins and Style, 1953 | DRB |

Reaction thermochemistry data

Data compiled by: Hussein Y. Afeefy, Joel F. Liebman, and Stephen E. Stein
Individual Reactions
By formula: 2HNaO + C2H6O4 = H2 + 2CHNaO2 + 2H2O
Quantity | Value | Units | Method | Reference | Comment |
---|---|---|---|---|---|
ΔrH° | -293.3 ± 5.0 | kJ/mol | Cm | Jenkins and Style, 1953 | solid phase; Reanalyzed by Cox and Pilcher, 1970, Original value = -292. kJ/mol |

Henry's Law data

Data compiled by: Rolf Sander
Henry's Law constant (water solution)
kH(T) = k°H exp(d(ln(kH))/d(1/T) ((1/T) - 1/(298.15 K)))
k°H = Henry's law constant for solubility in water at 298.15 K (mol/(kg*bar))
d(ln(kH))/d(1/T) = Temperature dependence constant (K)
k°H (mol/(kg*bar)) | d(ln(kH))/d(1/T) (K) | Method | Reference |
---|---|---|---|
>1.0×10+7 | M | N/A |

References

Stewart, 2004
Stewart, J.J.P.,
Comparison of the accuracy of semiempirical and some DFT methods for predicting heats of formation,
J. Mol. Model, 2004, 10, 1, 6-10, https://doi.org/10.1007/s00894-003-0157-6
. [all data]
Jenkins and Style, 1953
Jenkins, A.D.; Style, D.W.G.,
The thermochemistry and pyrolysis of bishydroxymethyl,
J. Chem. Soc., 1953, 2337-23. [all data]
Cox and Pilcher, 1970
Cox, J.D.; Pilcher, G.,
Thermochemistry of Organic and Organometallic Compounds, Academic Press, New York, 1970, 1-636. [all data]