Naphthalene, decahydro-4a-methyl-1-methylene-7-(1-methylethenyl)-, [4aR-(4aα,7α,8aβ)]-
- Formula: C15H24
- Molecular weight: 204.3511
- IUPAC Standard InChIKey: YOVSPTNQHMDJAG-ZNMIVQPWSA-N
- CAS Registry Number: 17066-67-0
- Chemical structure:
View 3d structure (requires JavaScript / HTML 5) - Stereoisomers:
- Other names: β-Selinene; (+)-β-Selinene; Selina-4(14),11-diene; 7-Isopropenyl-4a-methyl-1-methylenedecahydronaphthalene; Eudesma-4(14),11-diene; β-Eudesmene; 7-Isopropenyl-4a-methyl-1-methylenedecahydronaphthalene-, (4aR-(4aα,7α,8aβ))-; 18423-23-9; selina-4(10),11-diene

Kovats' RI, non-polar column, isothermal

Column type | Active phase | Temperature (C) | I | Reference | Comment |
---|---|---|---|---|---|
Capillary | OV-101 | 130. | 1477. | Clarke, Perry, et al., 1994 | |
Packed | SF-96 | 170. | 1507. | Andersen, Bissonette, et al., 1977 | Column length: 7.3 m |
Packed | Apiezon L | 155. | 1530. | Ohta, Andersen, et al., 1977 | He, Silanized support (not indicated); Column length: 7.3 m; Column diameter: 3.17 mm |

Kovats' RI, non-polar column, temperature ramp

Column type | Active phase | I | Reference | Comment |
---|---|---|---|---|
Capillary | HP-5MS | 1509. | Jalali-Heravi, Zekavat, et al., 2006 | 60. m/0.25 mm/0.25 μm, He, 40. C @ 1. min, 3. K/min, 250. C @ 20. min |
Capillary | DB-1 | 1491. | Mevy, Bessiere, et al., 2006 | He, 60. C @ 3. min, 3. K/min; Column length: 25. m; Column diameter: 0.2 mm; Tend: 220. C |
Capillary | BP-1 | 1478. | Srivastava, Srivastava, et al., 2006 | 30. m/0.32 mm/0.25 μm, N2, 5. K/min, 220. C @ 3. min; Tstart: 60. C |
Capillary | CP Sil 8 CB | 1497. | Tayoub, Schwob, et al., 2006 | 30. m/0.25 mm/0.25 μm, H2, 50. C @ 2. min, 3. K/min; Tend: 220. C |
Capillary | CP Sil 8 CB | 1497. | Tayoub, Schwob, et al., 2006, 2 | 30. m/0.25 mm/0.25 μm, H2, 50. C @ 2. min, 3. K/min; Tend: 220. C |
Capillary | HP-5MS | 1489. | Asuming, Beauchamp, et al., 2005 | 30. m/0.25 mm/0.25 μm, He, 50. C @ 10. min, 3. K/min, 250. C @ 5. min |
Capillary | HP-5MS | 1484. | Juliani, Zygadlo, et al., 2004 | 30. m/0.25 mm/0.25 μm, He, 60. C @ 1. min, 4. K/min, 200. C @ 15. min |
Capillary | CP Sil 5 CB | 1493. | Ogunwande, Olawore, et al., 2004 | 25. m/0.25 mm/0.15 μm, H2, 3. K/min; Tstart: 50. C; Tend: 230. C |
Capillary | DB-5 | 1476. | Santos, Lopes, et al., 2004 | 30. m/0.25 mm/0.25 μm, He, 5. K/min; Tstart: 60. C; Tend: 300. C |
Capillary | DB-5 | 1486. | Amparo Blázquez, Pérez, et al., 2003 | He, 40. C @ 5. min, 3. K/min, 280. C @ 5. min; Column length: 25. m; Column diameter: 0.25 mm |
Capillary | HP-5MS | 1464. | Couladis, Chinou, et al., 2003 | 30. m/0.25 mm/0.25 μm, He, 3. K/min; Tstart: 60. C; Tend: 280. C |
Capillary | DB-5 | 1486. | Lucero, Estell, et al., 2003 | 30. m/0.25 mm/0.25 μm, He, 3. K/min; Tstart: 60. C |
Capillary | DB-5 | 1472. | Marongiu, Piras, et al., 2003 | 30. m/0.25 mm/0.25 μm, He, 3. K/min, 240. C @ 30. min; Tstart: 60. C |
Capillary | CP Sil 5 CB | 1492. | Ogunwande, Olawore, et al., 2003 | 25. m/0.25 mm/0.15 μm, He, 3. K/min; Tstart: 50. C; Tend: 230. C |
Capillary | HP-5 | 1475. | Özcan, Tzakou, et al., 2003 | 30. m/0.25 mm/0.25 μm, He, 3. K/min; Tstart: 60. C; Tend: 280. C |
Capillary | DB-5 | 1486. | Viña and Murillo, 2003 | 30. m/0.25 mm/0.25 μm, He, 50. C @ 5. min, 0.5 K/min, 250. C @ 10. min |
Capillary | HP-5 | 1488. | Juliani and Simon, 2002 | 30. m/0.25 mm/0.25 μm, He, 60. C @ 1. min, 4. K/min, 200. C @ 15. min |
Capillary | SSP-1 | 1457. | Nagarajan, Rao, et al., 2001 | 30. m/0.32 mm/0.25 μm, He, 50. C @ 2. min, 2. K/min, 250. C @ 5. min |
Capillary | HP-1 | 1476. | Rajeswara Rao, 2001 | 25. m/0.2 mm/0.25 μm, He, 4. K/min; Tstart: 100. C; Tend: 220. C |
Capillary | DB-1 | 1466. | Senatore and Rigano, 2001 | 30. m/0.25 mm/0.25 μm, He, 40. C @ 5. min, 2. K/min, 260. C @ 20. min |
Capillary | HP-5 | 1483. | Tzakou and Couladis, 2001 | 30. m/0.25 mm/0.25 μm, He, 3. K/min; Tstart: 60. C; Tend: 280. C |
Capillary | DB-5 | 1485. | Adams, 2000 | 30. m/0.26 mm/0.25 μm, He, 3. K/min; Tstart: 60. C; Tend: 246. C |
Capillary | HP-5MS | 1485. | Roussis, Tsoukatou, et al., 2000 | 30. m/0.25 mm/0.25 μm, He, 3. K/min; Tstart: 60. C; Tend: 280. C |
Capillary | DB-5 | 1436. | Dickens, 1999 | 30. m/0.25 mm/0.25 μm, 50. C @ 2. min, 15. K/min, 235. C @ 2. min |
Capillary | CP Sil 5 CB | 1484. | Kaul, Gujral, et al., 1999 | He, 5. K/min; Column length: 25. m; Column diameter: 0.25 mm; Tstart: 60. C; Tend: 280. C |
Capillary | DB-5 | 1485. | Lopes, Kato, et al., 1999 | 3. K/min; Column length: 30. m; Column diameter: 0.25 mm; Tstart: 60. C; Tend: 240. C |
Capillary | DB-5 | 1485. | Lopes, Kato, et al., 1999 | 3. K/min; Column length: 30. m; Column diameter: 0.25 mm; Tstart: 60. C; Tend: 240. C |
Capillary | HP-5 | 1482. | Sajjadi and Ghassemi, 1999 | 30. m/0.25 mm/0.25 μm, He, 4. K/min; Tstart: 60. C; Tend: 280. C |
Capillary | HP-5MS | 1479. | Siani, Ramos, et al., 1999 | 30. m/0.32 mm/0.25 μm, He, 70. C @ 5. min, 3. K/min; Tend: 250. C |
Capillary | DB-5 | 1486. | da Silva, Andrade, et al., 1999 | 30. m/0.25 mm/0.25 μm, He, 3. K/min; Tstart: 60. C; Tend: 240. C |
Capillary | Methyl Silicone | 1480. | Mallavarapu, Rao, et al., 1998 | N2, 5. K/min; Column length: 25. m; Column diameter: 0.5 mm; Tstart: 60. C; Tend: 220. C |
Capillary | DB-5 | 1474. | Senatore, Urrunaga Soria, et al., 1998 | 30. m/0.25 mm/0.25 μm, He, 40. C @ 5. min, 2. K/min, 250. C @ 20. min |
Capillary | DB-1 | 1485. | Fiorini, Fourasté, et al., 1997 | He, 3. K/min; Column length: 30. m; Column diameter: 0.23 mm; Tstart: 50. C; Tend: 200. C |
Capillary | SE-30 | 1480. | Jantan, Ali, et al., 1995 | N2, 60. C @ 10. min, 3. K/min, 180. C @ 1. min; Column length: 25. m; Column diameter: 0.2 mm |
Capillary | DB-5 | 1479. | Loayza, Abujder, et al., 1995 | 40. C @ 2. min, 2. K/min, 210. C @ 120. min; Column length: 30. m |
Capillary | DB-5 | 1486. | Loayza, Abujder, et al., 1995 | 40. C @ 2. min, 2. K/min, 210. C @ 120. min; Column length: 30. m |
Capillary | DB-5 | 1486. | Loayza, Abujder, et al., 1995 | 40. C @ 2. min, 2. K/min, 210. C @ 120. min; Column length: 30. m |
Capillary | HP-1 | 1470. | Raharivelomanana, Cambon, et al., 1993 | 6. K/min, 240. C @ 10. min; Column length: 15. m; Column diameter: 0.32 mm; Tstart: 40. C |
Capillary | SPB-1 | 1502. | Wong and Tie, 1993 | He, 35. C @ 5. min, 3. K/min, 200. C @ 20. min; Column length: 50. m; Column diameter: 0.20 mm |

Kovats' RI, non-polar column, custom temperature program

Column type | Active phase | I | Reference | Comment |
---|---|---|---|---|
Capillary | HP-5 | 1485. | de Marchese, de Heluani, et al., 2007 | He; Program: 60C(5min) => 3C/min => 100C => 1C/min => 160C => 10C/min => 240C(10min) |
Capillary | HP-5 | 1484. | Sibanda, Chigwada, et al., 2004 | 30. m/0.25 mm/0.25 μm, He; Program: 40C(10min) => 3C/min => 200C => 2C/min => 220C |
Capillary | DB-5 | 1478. | Araújo, Silveira, et al., 2003 | 30. m/0.25 mm/0.25 μm, He; Program: 35C => 4C/min => 180C => 20C/min => 280C |
Capillary | HP-5 | 1487. | Novak, Zitterl-Eglseer, et al., 2001 | 30. m/0.25 mm/0.25 μm, He; Program: 50 0C 5 K/min -> 140 0C 2 K/min -> 170 0C |
Capillary | DB-5 | 1436. | Dickens J.C., 2000 | Program: not specified |
Capillary | AT-5 | 1484. | Khouri, Usubillaga, et al., 2000 | 60. m/0.25 mm/0.25 μm, He; Program: 60 C 4K/min -> 200 C 10 K/min -> 280 C |
Capillary | DB-5MS | 1484. | Maia, Andrade, et al., 2000 | 30. m/0.25 mm/0.25 μm, He; Program: 40C => 2C/min => 60C => 4C/min => 260C |
Capillary | DB-5 | 1464. | Roscigno, 1998 | 30. m/0.25 mm/0.25 μm; Program: 50C(5min) => 2C/min => 250C (60min) => 2C/min => 270C => 1C/min => 290C |
Capillary | DB-5 | 1471. | Roscigno, 1998 | 30. m/0.25 mm/0.25 μm; Program: 50C(5min) => 2C/min => 250C (60min) => 2C/min => 270C => 1C/min => 290C |

Kovats' RI, polar column, isothermal

Column type | Active phase | Temperature (C) | I | Reference | Comment |
---|---|---|---|---|---|
Packed | Carbowax 20M | 150. | 1749. | Andersen, Bissonette, et al., 1977 | Column length: 7.3 m |
Packed | Carbowax 20M | 150. | 1749. | Ohta, Andersen, et al., 1977 | Column length: 7.3 m; Column diameter: 3.17 mm |
Packed | Carbowax 20M | 165. | 1765.5 | Ohta, Andersen, et al., 1977 | Column length: 7.3 m; Column diameter: 3.17 mm |
Packed | Carbowax 20M | 165. | 1766. | Andersen and Falcone, 1969 |

Kovats' RI, polar column, temperature ramp

Column type | Active phase | I | Reference | Comment |
---|---|---|---|---|
Capillary | Innowax | 1725. | Viña and Murillo, 2003 | 30. m/0.25 mm/0.25 μm, He, 50. C @ 5. min, 0.5 K/min, 250. C @ 10. min |
Capillary | Supelcowax-10 | 1727. | Tzakou and Couladis, 2001 | 30. m/0.32 mm/0.25 μm, He, 3. K/min; Tstart: 75. C; Tend: 230. C |
Capillary | Carbowax 20M | 1743. | Mallavarapu, Rao, et al., 1998 | N2, 5. K/min; Column length: 25. m; Column diameter: 0.5 mm; Tstart: 60. C; Tend: 200. C |
Capillary | Supelcowax-10 | 1715. | Loayza, Abujder, et al., 1995 | 40. C @ 2. min, 2. K/min, 210. C @ 120. min; Column length: 30. m |
Capillary | Supelcowax-10 | 1700. | Loayza, Abujder, et al., 1995 | 40. C @ 2. min, 2. K/min, 210. C @ 120. min; Column length: 30. m |
Capillary | Supelcowax-10 | 1743. | Wong and Tie, 1993 | He, 35. C @ 5. min, 3. K/min, 200. C @ 20. min; Column length: 60. m; Column diameter: 0.25 mm |
Capillary | Carbowax 20M | 1695. | Randriamiharisoa and Gaydou, 1987 | He, 2. K/min; Column length: 50. m; Column diameter: 0.3 mm; Tstart: 70. C; Tend: 210. C |

Van Den Dool and Kratz RI, non-polar column, temperature ramp

Column type | Active phase | I | Reference | Comment |
---|---|---|---|---|
Capillary | DB-5 | 1487. | Baccouri, Ben Temime, et al., 2007 | 30. m/0.25 mm/0.25 μm, He, 3. K/min; Tstart: 60. C; Tend: 240. C |
Capillary | HP-5 | 1492. | Dehghan, Solaimanian, et al., 2007 | 25. m/0.25 mm/0.25 μm, He, 60. C @ 2. min, 4. K/min; Tend: 240. C |
Capillary | DB-5 | 1489. | Flamini, Cioni, et al., 2007 | 30. m/0.25 mm/0.25 μm, He, 3. K/min; Tstart: 60. C; Tend: 240. C |
Capillary | HP-5MS | 1490. | Kundakovic, Fokialakis, et al., 2007 | 30. m/0.25 mm/0.25 μm, He, 3. K/min; Tstart: 60. C; Tend: 280. C |
Capillary | DB-5 | 1483. | Martins, Santos, et al., 2007 | 30. m/0.22 mm/0.25 μm, 60. C @ 2. min, 3. K/min; Tend: 240. C |
Capillary | Methyl Silicone | 1478. | Melo, Corrêa, et al., 2007 | 30. m/0.25 mm/0.25 μm, He, 2. K/min, 220. C @ 15. min; Tstart: 80. C |
Capillary | RTX-1 | 1483. | Paolini, Muselli, et al., 2007 | 60. m/0.22 mm/0.25 μm, He, 2. K/min, 230. C @ 35. min; Tstart: 60. C |
Capillary | HP-5 | 1487. | Quijano, Salamanca, et al., 2007 | 30. m/0.25 mm/0.25 μm, He, 50. C @ 4. min, 4. K/min, 250. C @ 10. min |
Capillary | HP-5MS | 1488. | Saroglou, Arfan, et al., 2007 | 30. m/0.25 mm/0.25 μm, He, 60. C @ 5. min, 4. K/min; Tend: 280. C |
Capillary | HP-5MS | 1485. | Saroglou, Marin, et al., 2007 | 30. m/0.25 mm/0.25 μm, He, 60. C @ 5. min, 4. K/min; Tend: 280. C |
Capillary | ZB-5 | 1486. | Simoniatto, Bonani, et al., 2007 | 30. m/0.25 mm/0.25 μm, He, 3. K/min; Tstart: 50. C; Tend: 250. C |
Capillary | DB-5 | 1485. | Telascrea, de Araujo, et al., 2007 | 30. m/0.25 mm/0.25 μm, He, 3. K/min; Tstart: 60. C; Tend: 240. C |
Capillary | HP-5MS | 1481. | Vagionas, Ngassapa, et al., 2007 | 30. m/0.25 mm/0.25 μm, He, 3. K/min; Tstart: 60. C; Tend: 280. C |
Capillary | HP-5MS | 1509.1 | Zeng, Zhao, et al., 2007 | 30. m/0.25 mm/0.25 μm, He, 4. K/min; Tstart: 80. C; Tend: 300. C |
Capillary | BP-1 | 1488. | Blanc, Bradesi, et al., 2006 | 50. m/0.22 mm/0.25 μm, 2. K/min, 220. C @ 20. min; Tstart: 60. C |
Capillary | SPB-1 | 1470. | Blagojevic, Radulovic, et al., 2006 | 30. m/0.25 mm/0.25 μm, He, 50. C @ 3. min, 5. K/min, 250. C @ 15. min |
Capillary | DB-5 | 1474. | Blagojevic, Radulovic, et al., 2006 | 30. m/0.2 mm/0.25 μm, He, 50. C @ 3. min, 5. K/min, 250. C @ 15. min |
Capillary | BP-1 | 1485. | Bousmaha, Boti, et al., 2006 | 50. m/0.25 mm/0.25 μm, He, 2. K/min, 220. C @ 20. min; Tstart: 60. C |
Capillary | RTX-1 | 1483. | Cavalli, Tomi, et al., 2006 | 60. m/0.22 mm/0.25 μm, He, 2. K/min, 230. C @ 45. min; Tstart: 60. C |
Capillary | BP-1 | 1482. | Duquesnoy, Dinh, et al., 2006 | 50. m/0.22 mm/0.25 μm, He, 2. K/min, 220. C @ 20. min; Tstart: 60. C |
Capillary | HP-5 | 1488. | Flamini, Tebano, et al., 2006 | 30. m/0.25 mm/0.25 μm, N2, 60. C @ 10. min, 5. K/min; Tend: 220. C |
Capillary | BP-1 | 1486. | Gonny, Cavaleiro, et al., 2006 | 50. m/0.22 mm/0.25 μm, He, 2. K/min, 220. C @ 20. min; Tstart: 60. C |
Capillary | HP-5 | 1487. | Javidnia K., Miri R., et al., 2006 | 30. m/0.25 mm/0.25 μm, He, 3. K/min; Tstart: 60. C; Tend: 260. C |
Capillary | DB-1 | 1487. | Kuiate, Bessière, et al., 2006 | 30. m/0.25 mm/0.25 μm, N2, 4. K/min; Tstart: 50. C; Tend: 220. C |
Capillary | DB-5 | 1484. | Masoudi, Esmaeili, et al., 2006 | 50. m/0.2 mm/0.32 μm, N2, 60. C @ 3. min, 5. K/min, 220. C @ 5. min |
Capillary | DB-5 | 1485. | Masoudi, Esmaeili, et al., 2006 | 50. m/0.2 mm/0.32 μm, N2, 60. C @ 3. min, 5. K/min, 220. C @ 5. min |
Capillary | RTX-1 | 1480. | Paolini J., Desjobert J.M., et al., 2006 | 60. m/0.22 mm/0.25 μm, He, 2. K/min, 230. C @ 35. min; Tstart: 60. C |
Capillary | DB-5 | 1477. | Pavlovic, Tzakou, et al., 2006 | 30. m/0.32 mm/0.25 μm, He, 3. K/min; Tstart: 60. C; Tend: 280. C |
Capillary | DB-1 | 1482. | Ramezani, Behravan, et al., 2006 | 30. m/0.25 mm/0.25 μm, He, 2.5 K/min; Tstart: 50. C; Tend: 265. C |
Capillary | OV-1 | 1484. | Rubiolo P., Matteodo M., et al., 2006 | 25. m/0.25 mm/0.25 μm, He, 50. C @ 1. min, 3. K/min, 220. C @ 5. min |
Capillary | HP-5MS | 1481. | Saroglou, Dorizas, et al., 2006 | 30. m/0.25 mm/0.25 μm, He, 60. C @ 5. min, 4. K/min; Tend: 280. C |
Capillary | HP-5MS | 1480. | Silva-Brandão, Solferini, et al., 2006 | 30. m/0.25 mm/0.25 μm, He, 3. K/min; Tstart: 60. C; Tend: 300. C |
Capillary | DB-1 | 1486. | Agnaniet, Makani, et al., 2005 | 30. m/0.25 mm/0.25 μm, N2, 5. K/min; Tstart: 50. C; Tend: 200. C |
Capillary | HP-5 | 1487. | Celik, Gokturk, et al., 2005 | 30. m/0.25 mm/0.25 μm, N2, 60. C @ 10. min, 5. K/min; Tend: 220. C |
Capillary | DB-1 | 1482. | Dob, Berramdane, et al., 2005 | 30. m/0.32 mm/0.25 μm, N2, 50. C @ 3. min, 2. K/min, 260. C @ 5. min |
Capillary | 5 % Phenyl methyl siloxane | 1520. | Estevez, Ventanas, et al., 2005 | 30. m/0.25 mm/1. μm, He, 40. C @ 10. min, 7. K/min, 250. C @ 5. min |
Capillary | DB-1 | 1458. | Fanciullino, Gancel, et al., 2005 | 30. m/0.25 mm/0.25 μm, He, 3. K/min, 250. C @ 20. min; Tstart: 40. C |
Capillary | BP-1 | 1484. | Ferrari, Tomi, et al., 2005 | 50. m/0.22 mm/0.25 μm, He, 2. K/min, 220. C @ 20. min; Tstart: 60. C |
Capillary | HP-5 | 1489. | Flamini, Luigi Cioni, et al., 2005 | 30. m/0.25 mm/0.25 μm, N2, 60. C @ 10. min, 5. K/min; Tend: 220. C |
Capillary | DB-1 | 1458. | Gancel, Ollitrault, et al., 2005 | 30. m/0.25 mm/0.25 μm, He, 3. K/min, 250. C @ 20. min; Tstart: 40. C |
Capillary | DB-1 | 1485. | bin Jantan, Yalvema, et al., 2005 | 25. m/0.25 mm/0.25 μm, 60. C @ 10. min, 3. K/min, 180. C @ 10. min |
Capillary | DB-5 | 1488. | bin Jantan, Yalvema, et al., 2005, 2 | 25. m/0.25 mm/0.25 μm, N2, 75. C @ 10. min, 3. K/min, 210. C @ 1. min |
Capillary | HP-5 | 1489. | Javidnia, Miri, et al., 2005 | He, 3. K/min; Column length: 30. m; Column diameter: 0.25 mm; Tstart: 60. C; Tend: 260. C |
Capillary | HP-5MS | 1484. | Pino, Mesa, et al., 2005 | 30. m/0.25 mm/0.25 μm, He, 60. C @ 2. min, 4. K/min, 250. C @ 20. min |
Capillary | DB-5MS | 1481. | Seo and Baek, 2005 | 60. m/0.25 mm/0.25 μm, He, 2. K/min, 200. C @ 20. min; Tstart: 40. C |
Capillary | DB-1 | 1483. | Tchoumbougnang, Zollo, et al., 2005 | 30. m/0.25 mm/0.25 μm, N2, 5. K/min; Tstart: 50. C; Tend: 200. C |
Capillary | BP-1 | 1483. | Vellutini, Baldovini, et al., 2005 | 50. m/0.22 mm/0.25 μm, He, 2. K/min, 230. C @ 35. min; Tstart: 60. C |
Capillary | SPB-1 | 1470. | Cavaleiro, Salgueiro, et al., 2004 | 30. m/0.2 mm/0.2 μm, He, 3. K/min, 220. C @ 15. min; Tstart: 70. C |
Capillary | HP-5MS | 1489. | Chorianopoulos, Kalpoutzakis, et al., 2004 | 30. m/0.25 mm/0.25 μm, He, 3. K/min; Tstart: 60. C; Tend: 280. C |
Capillary | DB-5 | 1488. | Flamini, Cioni, et al., 2004 | 30. m/0.25 mm/0.25 μm, N2, 3. K/min; Tstart: 60. C; Tend: 240. C |
Capillary | DB-5 | 1488. | Flamini, Cioni, et al., 2004 | 30. m/0.25 mm/0.25 μm, N2, 3. K/min; Tstart: 60. C; Tend: 240. C |
Capillary | BP-1 | 1485. | Gonny, Bradesi, et al., 2004 | 50. m/0.22 mm/0.25 μm, 2. K/min, 220. C @ 20. min; Tstart: 60. C |
Capillary | HP-5MS | 1487. | Grujic-Jovanovic, Skaltsa, et al., 2004 | 30. m/0.25 mm/0.25 μm, He, 60. C @ 5. min, 4. K/min; Tend: 280. C |
Capillary | HP-5 | 1488. | Isidorov, Krajewska, et al., 2004 | 30. m/0.25 mm/0.25 μm, He, 3. K/min; Tstart: 40. C; Tend: 250. C |
Capillary | HP-5 | 1487. | Javidnia, Miri, et al., 2004 | He, 3. K/min; Column length: 30. m; Column diameter: 0.25 mm; Tstart: 60. C; Tend: 260. C |
Capillary | HP-5MS | 1488. | Karioti, Hadjipavlou-Litina, et al., 2004 | 30. m/0.25 mm/0.25 μm, He, 60. C @ 5. min, 4. K/min; Tend: 280. C |
Capillary | SPB-5 | 1486. | Pino, Marbot, et al., 2004 | 30. m/0.25 mm/0.25 μm, He, 60. C @ 2. min, 4. K/min, 250. C @ 20. min |
Capillary | BP-1 | 1483. | Tam, Thuam, et al., 2004 | 50. m/0.22 mm/0.25 μm, He, 2. K/min, 220. C @ 20. min; Tstart: 60. C |
Capillary | Optima 5 | 1474. | Vérité, Nacer, et al., 2004 | 25. m/0.25 mm/0.25 μm, He, 3. K/min, 280. C @ 20. min; Tstart: 60. C |
Capillary | DB-5MS | 1496. | Yu, Kim, et al., 2004 | 30. m/0.25 mm/0.25 μm, He, 40. C @ 5. min, 4. K/min, 200. C @ 20. min |
Capillary | DB-5 | 1484. | bin Ahmad and bin Jantan, 2003 | 25. m/0.25 mm/0.25 μm, N2, 75. C @ 10. min, 3. K/min, 210. C @ 1. min |
Capillary | BPX-5 | 1486. | bin Ahmad and bin Jantan, 2003, 2 | 30. m/0.25 mm/0.25 μm, N2, 75. C @ 10. min, 3. K/min, 210. C @ 1. min |
Capillary | DB-5 | 1487. | Bader, Flamini, et al., 2003 | 30. m/0.25 mm/0.25 μm, He, 3. K/min; Tstart: 60. C; Tend: 240. C |
Capillary | BP-1 | 1486. | Bianchini, Tomi, et al., 2003 | 50. m/0.22 mm/0.25 μm, He, 2. K/min, 230. C @ 35. min; Tstart: 60. C |
Capillary | HP-5 | 1489. | Bougatsos, Meyer, et al., 2003 | 30. m/0.25 mm/0.25 μm, He, 3. K/min; Tstart: 60. C; Tend: 280. C |
Capillary | HP-5 | 1487. | Campeol, Flamini, et al., 2003 | 30. m/0.25 mm/0.25 μm, N2, 60. C @ 10. min, 5. K/min; Tend: 220. C |
Capillary | SPB-1 | 1472. | Cavaleiro, Salgueiro, et al., 2003 | 30. m/0.2 mm/0.2 μm, He, 3. K/min, 220. C @ 15. min; Tstart: 70. C |
Capillary | RTX-1 | 1483. | Cavalli, Tomi, et al., 2003 | 60. m/0.22 mm/0.25 μm, He, 2. K/min, 230. C @ 45. min; Tstart: 60. C |
Capillary | Ultra-2 | 1489. | Ceva-Antunes, Bizzo, et al., 2003 | 25. m/0.25 mm/0.33 μm, H2, 40. C @ 2. min, 3. K/min, 280. C @ 10. min |
Capillary | HP-5 | 1489. | Dural, Bagci, et al., 2003 | 30. m/0.25 mm/0.25 μm, N2, 60. C @ 10. min, 5. K/min; Tend: 220. C |
Capillary | HP-5 | 1487. | Ertugrul, Dural, et al., 2003 | 30. m/0.25 mm/0.25 μm, N2, 60. C @ 10. min, 5. K/min; Tend: 220. C |
Capillary | DB-1 | 1462. | de Feo, Bruno, et al., 2003 | 30. m/0.25 mm/0.25 μm, He, 40. C @ 5. min, 2. K/min, 250. C @ 20. min |
Capillary | HP-5 | 1493. | Flamini, Luigi Cioni, et al., 2003 | 30. m/0.25 mm/0.25 μm, N2, 60. C @ 10. min, 5. K/min; Tend: 220. C |
Capillary | DB-1 | 1458. | Gancel, Ollitrault, et al., 2003 | 30. m/0.25 mm/0.25 μm, He, 3. K/min, 250. C @ 20. min; Tstart: 40. C |
Capillary | PE-5 | 1487. | Isidorov and Vinogorova, 2003 | He, 3. K/min; Column length: 30. m; Column diameter: 0.25 mm; Tstart: 40. C; Tend: 280. C |
Capillary | HP-5 | 1481. | Isidorov, Vinogorova, et al., 2003 | 25. C @ 5. min, 3. K/min; Column length: 30. m; Column diameter: 0.25 mm; Tend: 150. C |
Capillary | DB-5 | 1484. | Jantan, Ling, et al., 2003 | 30. m/0.25 mm/0.25 μm, He, 75. C @ 10. min, 3. K/min, 230. C @ 20. min |
Capillary | HP-5 | 1487. | Macchioni, Cioni, et al., 2003 | 30. m/0.25 mm/0.25 μm, He, 3. K/min; Tstart: 60. C; Tend: 240. C |
Capillary | DB-1 | 1463. | Senatore, Lentini, et al., 2003 | 30. m/0.25 mm/0.25 μm, He, 40. C @ 5. min, 2. K/min, 270. C @ 20. min |
Capillary | HP-5 | 1485. | Skaltsa, Demetzos, et al., 2003 | 30. m/0.25 mm/0.25 μm, He, 60. C @ 5. min, 4. K/min; Tend: 280. C |
Capillary | HP-5 | 1490. | Tsiri, Kretsi, et al., 2003 | 30. m/0.25 mm/0.25 μm, He, 3. K/min; Tstart: 60. C; Tend: 280. C |
Capillary | SPB-1 | 1472. | Cavaleiro, Salgueiro, et al., 2002 | 30. m/0.20 mm/0.20 μm, He, 3. K/min, 220. C @ 15. min; Tstart: 70. C |
Capillary | HP-5MS | 1487. | Couladis, Chinou, et al., 2002 | 30. m/0.25 mm/0.25 μm, He, 3. K/min; Tstart: 60. C; Tend: 300. C |
Capillary | HP-5MS | 1485. | Demetzos, Angelopoulou, et al., 2002 | 30. m/0.25 mm/0.25 μm, 50. C @ 5. min, 3. K/min; Tend: 280. C |
Capillary | DB-5 | 1487. | Flamini, Cioni, et al., 2002 | 30. m/0.25 mm/0.25 μm, He, 3. K/min; Tstart: 60. C; Tend: 240. C |
Capillary | HP-5 | 1493. | Flamini, Cioni, et al., 2002, 2 | 30. m/0.25 mm/0.25 μm, N2, 60. C @ 10. min, 5. K/min; Tend: 220. C |
Capillary | HP-5 | 1490. | Fokialakis, Magiatis, et al., 2002 | 30. m/0.25 mm/0.25 μm, 60. C @ 5. min, 3. K/min; Tend: 280. C |
Capillary | DB-1 | 1482. | bin Jantan and bin Ahmad, 2002 | N2, 60. C @ 10. min, 3. K/min, 180. C @ 10. min; Column length: 25. m; Column diameter: 0.25 mm |
Capillary | DB-5 | 1485. | Javidnia, Miri, et al., 2002 | 30. m/0.25 mm/0.25 μm, He, 4. K/min; Tstart: 60. C; Tend: 260. C |
Capillary | RTX-5 | 1487. | Mondello, Zappia, et al., 2002 | 30. m/0.25 mm/0.25 μm, He, 45. C @ 6. min, 3. K/min, 300. C @ 10. min |
Capillary | CP Sil 5 CB | 1476. | Pino, Marbot, et al., 2002 | 25. m/0.25 mm/0.25 μm, N2, 60. C @ 6. min, 4. K/min; Tend: 280. C |
Capillary | CP Sil 5 CB | 1483. | Pino, Marbot, et al., 2002, 2 | 30. m/0.25 mm/0.25 μm, H2, 60. C @ 10. min, 2. K/min, 280. C @ 40. min |
Capillary | CP Sil 5 CB | 1483. | Pino, Marbot, et al., 2002, 3 | 50. m/0.32 mm/0.4 μm, He, 60. C @ 10. min, 3. K/min, 280. C @ 60. min |
Capillary | DB-5 | 1487. | Isidorov, Zenkevich, et al., 2001 | He, 3. K/min; Column length: 30. m; Column diameter: 0.25 mm; Tstart: 50. C; Tend: 250. C |
Capillary | DB-5 | 1494. | Nogueira, Bittrich, et al., 2001 | 30. m/0.25 mm/0.25 μm, H2, 3. K/min; Tstart: 60. C; Tend: 240. C |
Capillary | HP-5MS | 1485. | Skaltsa, Mavrommati, et al., 2001 | 30. m/0.25 mm/0.25 μm, He, 60. C @ 5. min, 4. K/min; Tend: 280. C |
Capillary | HP-5 | 1485. | Lazari, Skaltsa, et al., 2000 | 30. m/0.25 mm/0.25 μm, He, 50. C @ 5. min, 4. K/min; Tend: 280. C |
Capillary | DB-5 | 1485. | Maia, de Paula, et al., 2000 | 30. m/0.25 mm/0.25 μm, He, 60. C @ 2. min, 3. K/min; Tend: 240. C |
Capillary | DB-5 | 1485. | Maia, de Paula, et al., 2000 | 30. m/0.25 mm/0.25 μm, He, 60. C @ 2. min, 3. K/min; Tend: 240. C |
Capillary | HP-5 | 1484. | Skaltsa, Lazari, et al., 2000 | 30. m/0.25 mm/0.25 μm, He, 50. C @ 5. min, 4. K/min; Tend: 280. C |
Capillary | BP-1 | 1484. | Mazzoni, Tomi, et al., 1999 | 50. m/0.22 mm/0.25 μm, He, 2. K/min, 220. C @ 20. min; Tstart: 60. C |
Capillary | DB-1 | 1465. | Muselli, Hoi, et al., 1999 | 30. m/0.25 mm/0.25 μm, 50. C @ 3. min, 3. K/min; Tend: 220. C |
Capillary | Methyl Silicone | 1487. | Sumathykutty, Rao, et al., 1999 | 50. m/0.25 mm/0.17 μm, N2, 2. K/min; Tstart: 80. C; Tend: 200. C |
Capillary | CP Sil 5 CB | 1484. | Weyerstahl, Marschall, et al., 1999 | He, 5. K/min; Column length: 25. m; Column diameter: 0.25 mm; Tstart: 60. C; Tend: 260. C |
Capillary | OV-1 | 1467. | Bicchi, Rubiolo, et al., 1998 | 25. m/0.25 mm/0.3 μm, 50. C @ 1. min, 3. K/min, 200. C @ 20. min |
Capillary | OV-1 | 1467. | Bicchi, Fresia, et al., 1997 | 25. m/0.25 mm/0.3 μm, H2, 50. C @ 1. min, 3. K/min, 200. C @ 20. min |
Capillary | DB-5 | 1495. | Sagrero-Nieves, Bartley, et al., 1997 | 30. m/0.26 mm/0.25 μm, He, 2. K/min, 225. C @ 20. min; Tstart: 50. C |
Capillary | DB-1 | 1500. | Stashenko, Wiame, et al., 1995 | 30. m/0.20 mm/0.20 μm, He, 70. C @ 5. min, 4. K/min; Tend: 200. C |
Capillary | HP-101 | 1511. | Chung, Eiserich, et al., 1993 | N2, 3. K/min; Column length: 50. m; Column diameter: 0.25 mm; Tstart: 70. C; Tend: 200. C |

Van Den Dool and Kratz RI, non-polar column, custom temperature program

Column type | Active phase | I | Reference | Comment |
---|---|---|---|---|
Capillary | HP-5MS | 1493.4 | Andriamaharavo, 2014 | 30. m/0.25 mm/0.25 μm, He; Program: 60C (1 min) => 5 C/min => 210C => 10 C/min => 280C (15 min) |
Capillary | DB-5 | 1490. | Andrade, Sampaio, et al., 2007 | 30. m/0.25 mm/0.25 μm, He; Program: 40C(2min) => 4C/min => 220C => 20C/min => 280C |
Capillary | BPX-5 | 1486. | Dharmawan, Kasapis, et al., 2007 | 30. m/0.25 mm/0.25 μm, He; Program: 35C => 4C/min => 200C => 30C/min => 300C (3min) |
Capillary | CBP-5 | 1487. | Silva, Oliveira, et al., 2007 | 30. m/0.25 mm/0.25 μm, He; Program: 60C => 3C/min => 246C => 10C/min => 270C (5min) |
Capillary | BPX-5 | 1507. | Cardeal, da Silva, et al., 2006 | 30. m/0.25 mm/0.25 μm; Program: 35C(5min) => 3C/min => 210C => 40C/min => 240C (4min) |
Capillary | SE-52 | 1490. | Guerrini, Sacchetti, et al., 2006 | 30. m/0.32 mm/0.15 μm, He; Program: 45C => 1C/min => 100C => 5C/min => 250C (10min) |
Capillary | DB-5 | 1476. | Moon, Cliff, et al., 2006 | 30. m/0.32 mm/0.25 μm, He; Program: 40C(3min) => 3C/min => 180C => 10C/min => 260C(2min) |
Capillary | SE-52 | 1490. | Sacchetti, Guerrini, et al., 2006 | 30. m/0.32 mm/0.15 μm, He; Program: 45C => 1C/min => 100C => 5C/min => 250C(10min) |
Capillary | CBP-5 | 1484. | Oliveira, Campos, et al., 2005 | 30. m/0.25 mm/0.25 μm, He; Program: 60C => 3C/min => 240C => 10C/min => 280C(10min) |
Capillary | 5 % Phenyl methyl siloxane | 1490. | Sacchetti, Maietti, et al., 2005 | 30. m/0.32 mm/0.15 μm, He; Program: 45C => 1C/min => 100C => 5C/min => 250C (10min) |
Capillary | DB-5MS | 1482. | Zheng, Kim, et al., 2005 | 30. m/0.25 mm/0.25 μm, He; Program: 40 (5min) => 4C/min => 140C => 4C/min => 200C (20min) |
Capillary | SE-52 | 1490. | Sacchetti, Medici, et al., 2004 | 30. m/0.52 mm/0.15 μm, He; Program: 45C => 1C/min => 100C => 5C/min => 250C (10min) |
Capillary | HP-5MS | 1492. | de Kraker, Schurink, et al., 2003 | 30. m/0.25 mm/0.25 μm, He; Program: not specified |
Capillary | CBP-5 | 1480. | Azevedo, Campos, et al., 2002 | 50. m/0.25 mm/0.25 μm, He; Program: 60C(2min) => 3C/min => 240C => 10C/min => 280C(10min) |
Capillary | BP-1 | 1483. | Cavalli, Ranarivelo, et al., 2001 | 50. m/0.22 mm/0.25 μm; Program: not specified |
Capillary | SE-52 | 1481. | Lorenzo, Dellacassa, et al., 2001 | 25. m/0.32 mm/0.40 μm, H2; Program: 60 0C (8 min) 3 K/min -> 180 0C 20 K/min -> 250 0C (10 min) |
Capillary | DB-1 | 1502. | Eri, Khoo, et al., 2000 | 60. m/0.25 mm/0.25 μm, He; Program: -20C (5min) => 10C/min => 100C => 4C/min => 200C => 10C/min => 280C |

Van Den Dool and Kratz RI, polar column, temperature ramp

Column type | Active phase | I | Reference | Comment |
---|---|---|---|---|
Capillary | HP-Innowax | 1729. | Kundakovic, Fokialakis, et al., 2007 | 30. m/0.25 mm/0.25 μm, He, 3. K/min; Tstart: 60. C; Tend: 280. C |
Capillary | RTX-Wax | 1708. | Paolini, Muselli, et al., 2007 | 60. m/0.22 mm/0.25 μm, He, 2. K/min, 230. C @ 35. min; Tstart: 60. C |
Capillary | HP-Innowax | 1743. | Saroglou, Marin, et al., 2007 | 30. m/0.25 mm/0.5 μm, He, 3. K/min; Tstart: 60. C; Tend: 260. C |
Capillary | BP-20 | 1715. | Blanc, Bradesi, et al., 2006 | 50. m/0.22 mm/0.25 μm, 2. K/min, 220. C @ 20. min; Tstart: 60. C |
Capillary | BP-20 | 1713. | Bousmaha, Boti, et al., 2006 | 50. m/0.25 mm/0.25 μm, He, 2. K/min, 220. C @ 20. min; Tstart: 60. C |
Capillary | RTX-Wax | 1706. | Cavalli, Tomi, et al., 2006 | 60. m/0.22 mm/0.25 μm, He, 2. K/min, 230. C @ 45. min; Tstart: 60. C |
Capillary | BP-20 | 1714. | Duquesnoy, Dinh, et al., 2006 | 50. m/0.22 mm/0.25 μm, He, 2. K/min, 220. C @ 20. min; Tstart: 60. C |
Capillary | HP-Wax | 1715. | Flamini, Tebano, et al., 2006 | 30. m/0.25 mm/0.25 μm, N2, 60. C @ 10. min, 5. K/min; Tend: 220. C |
Capillary | BP-20 | 1719. | Gonny, Cavaleiro, et al., 2006 | 50. m/0.22 mm/0.25 μm, He, 2. K/min, 220. C @ 20. min; Tstart: 60. C |
Capillary | DB-Wax | 1719. | Pala-Paul, Copeland, et al., 2006 | 60. m/0.32 mm/0.25 μm, He, 3. K/min; Tstart: 35. C; Tend: 220. C |
Capillary | RTX-Wax | 1686. | Paolini J., Desjobert J.M., et al., 2006 | 60. m/0.22 mm/0.25 μm, He, 2. K/min, 230. C @ 35. min; Tstart: 60. C |
Capillary | PEG-20M | 1698. | Rubiolo P., Matteodo M., et al., 2006 | 25. m/0.25 mm/0.3 μm, He, 50. C @ 1. min, 3. K/min, 220. C @ 5. min |
Capillary | DB-Wax | 1702. | Fanciullino, Gancel, et al., 2005 | 30. m/0.25 mm/0.25 μm, He, 3. K/min, 250. C @ 20. min; Tstart: 40. C |
Capillary | BP-20 | 1713. | Ferrari, Tomi, et al., 2005 | 50. m/0.22 mm/0.25 μm, He, 2. K/min, 220. C @ 20. min; Tstart: 60. C |
Capillary | DB-Wax | 1698. | Gancel, Ollitrault, et al., 2005 | 30. m/0.25 mm/0.25 μm, He, 3. K/min, 250. C @ 20. min; Tstart: 40. C |
Capillary | Innowax | 1708. | Lee, Lee, et al., 2005 | 50. m/0.25 mm/0.25 μm, He, 50. C @ 3. min, 2. K/min, 220. C @ 20. min |
Capillary | BP-20 | 1716. | Vellutini, Baldovini, et al., 2005 | 50. m/0.22 mm/0.25 μm, He, 2. K/min, 230. C @ 35. min; Tstart: 60. C |
Capillary | Supelcowax-10 | 1712. | Cavaleiro, Salgueiro, et al., 2004 | 30. m/0.2 mm/0.2 μm, He, 3. K/min, 220. C @ 15. min; Tstart: 70. C |
Capillary | HP-Wax | 1705. | Flamini, Cioni, et al., 2004 | 30. m/0.25 mm/0.25 μm, N2, 3. K/min; Tstart: 60. C; Tend: 240. C |
Capillary | HP-Wax | 1705. | Flamini, Cioni, et al., 2004 | 30. m/0.25 mm/0.25 μm, N2, 3. K/min; Tstart: 60. C; Tend: 240. C |
Capillary | BP-20 | 1716. | Gonny, Bradesi, et al., 2004 | 50. m/0.22 mm/0.25 μm, 2. K/min, 220. C @ 20. min; Tstart: 60. C |
Capillary | HP-Innowax | 1751. | Grujic-Jovanovic, Skaltsa, et al., 2004 | 30. m/0.25 mm/0.5 μm, He, 3. K/min; Tstart: 60. C; Tend: 260. C |
Capillary | BP-20 | 1708. | Tam, Thuam, et al., 2004 | 50. m/0.22 mm/0.25 μm, He, 2. K/min, 220. C @ 20. min; Tstart: 60. C |
Capillary | BP-20 | 1719. | Bianchini, Tomi, et al., 2003 | 50. m/0.22 mm/0.25 μm, He, 2. K/min, 230. C @ 35. min; Tstart: 60. C |
Capillary | RTX-Wax | 1709. | Cavalli, Tomi, et al., 2003 | 60. m/0.22 mm/0.25 μm, He, 2. K/min, 230. C @ 45. min; Tstart: 60. C |
Capillary | DB-Wax | 1698. | Gancel, Ollitrault, et al., 2003 | 60. m/0.32 mm/0.25 μm, H2, 1.5 K/min, 245. C @ 20. min; Tstart: 40. C |
Capillary | HP-20M | 1686. | Jerkovic, Mastelic, et al., 2003 | 50. m/0.2 mm/0.2 μm, He, 70. C @ 4. min, 4. K/min, 180. C @ 10. min |
Capillary | HP-Innowax | 1743. | Skaltsa, Demetzos, et al., 2003 | 30. m/0.25 mm/0.5 μm, He, 3. K/min; Tstart: 60. C; Tend: 260. C |
Capillary | DB-Wax | 1695. | Choi, Kim. M.-S.L., et al., 2002 | 60. m/0.25 mm/0.25 μm, N2, 2. K/min, 230. C @ 20. min; Tstart: 70. C |
Capillary | Innowax | 1727. | Couladis, Chinou, et al., 2002 | 30. m/0.25 mm/0.5 μm, He, 3. K/min, 260. C @ 10. min; Tstart: 60. C |
Capillary | RTX-Wax | 1694. | Mondello, Zappia, et al., 2002 | 30. m/0.25 mm/0.25 μm, He, 45. C @ 6. min, 3. K/min, 250. C @ 10. min |
Capillary | AT-Wax | 1695. | Pino, Marbot, et al., 2002, 3 | 60. m/0.32 mm/0.25 μm, He, 65. C @ 10. min, 2. K/min, 250. C @ 60. min |
Capillary | DB-Wax | 1720. | Brophy, Goldsack, et al., 2000 | 60. m/0.50 mm/1.0 μm, He, 3. K/min; Tstart: 60. C; Tend: 225. C |
Capillary | DB-Wax | 1720. | Brophy, Goldsack, et al., 2000, 2 | 60. m/0.53 mm/1.0 μm, He, 3. K/min; Tstart: 50. C; Tend: 220. C |
Capillary | DB-Wax | 1720. | Brophy, Goldsack, et al., 2000, 3 | 60. m/0.53 mm/1.0 μm, He, 3. K/min; Tstart: 50. C; Tend: 220. C |
Capillary | CP-Wax 52CB | 1720. | Chagonda, Makanda, et al., 2000 | 25. m/0.25 mm/0.15 μm, 40. C @ 5. min, 3. K/min; Tend: 220. C |
Capillary | DB-Wax | 1720. | Brophy, Goldsack, et al., 1999 | He, 3. K/min; Column length: 60. m; Column diameter: 0.53 mm; Tstart: 50. C; Tend: 220. C |
Capillary | DB-Wax | 1720. | Brophy, Goldsack, et al., 1999, 2 | He, 3. K/min; Column length: 60. m; Column diameter: 0.53 mm; Tstart: 50. C; Tend: 220. C |
Capillary | BP-20 | 1712. | Mazzoni, Tomi, et al., 1999 | 50. m/0.22 mm/0.25 μm, He, 2. K/min, 220. C @ 20. min; Tstart: 60. C |
Capillary | Carbowax 20M | 1713. | Bicchi, Rubiolo, et al., 1998 | 25. m/0.25 mm/0.3 μm, H2, 50. C @ 1. min, 3. K/min, 200. C @ 20. min |
Capillary | DB-Wax | 1724. | Brophy, Forster, et al., 1998 | He, 3. K/min; Column length: 60. m; Column diameter: 0.32 mm; Tstart: 35. C; Tend: 220. C |
Capillary | SP-1000 | 1720. | Brophy, Forster, et al., 1998, 2 | He, 3. K/min; Column length: 85. m; Column diameter: 0.5 mm; Tstart: 60. C; Tend: 225. C |
Capillary | DB-Wax | 1720. | Brophy, Goldsack, et al., 1998 | He, 3. K/min; Column length: 60. m; Column diameter: 0.32 mm; Tstart: 65. C; Tend: 225. C |
Capillary | DB-Wax | 1720. | Brophy, Goldsack, et al., 1998, 2 | He, 3. K/min; Column length: 60. m; Column diameter: 0.32 mm; Tstart: 35. C; Tend: 220. C |
Capillary | DB-Wax | 1700. | Ollé, Baumes, et al., 1998 | 30. m/0.32 mm/0.5 μm, 40. C @ 3. min, 3. K/min, 245. C @ 20. min |
Capillary | Carbowax 20M | 1713. | Bicchi, Fresia, et al., 1997 | 25. m/0.25 mm/0.3 μm, 50. C @ 1. min, 3. K/min, 200. C @ 20. min |
Capillary | DB-Wax | 1720. | Brophy, Goldsack, et al., 1997 | He, 3. K/min; Column length: 60. m; Column diameter: 0.32 mm; Tstart: 65. C; Tend: 225. C |
Capillary | SP-1000 | 1720. | Brophy, Goldsack, et al., 1997, 2 | He, 3. K/min; Column length: 85. m; Column diameter: 0.5 mm; Tstart: 65. C; Tend: 225. C |
Capillary | DB-Wax | 1750. | Sagrero-Nieves, Bartley, et al., 1997 | 60. m/0.32 mm/0.5 μm, He, 2. K/min, 225. C @ 20. min; Tstart: 50. C |
Capillary | DB-Wax | 1725. | Stashenko, Wiame, et al., 1995 | 60. m/0.20 mm/0.20 μm, He, 70. C @ 5. min, 2. K/min; Tend: 180. C |
Capillary | HP-20M | 1711. | Chung, Eiserich, et al., 1993 | He, 3. K/min; Column length: 50. m; Column diameter: 0.25 mm; Tstart: 60. C; Tend: 190. C |

Van Den Dool and Kratz RI, polar column, custom temperature program

Column type | Active phase | I | Reference | Comment |
---|---|---|---|---|
Capillary | RTX-Wax | 1713. | Cavalli, Ranarivelo, et al., 2001 | 60. m/0.25 mm/0.25 μm; Program: not specified |

Normal alkane RI, non-polar column, isothermal

Column type | Active phase | Temperature (C) | I | Reference | Comment |
---|---|---|---|---|---|
Capillary | DB-5 | 25. | 1485. | Hemmateenejad, Jawadnia, et al., 2007 |

Normal alkane RI, non-polar column, temperature ramp

Column type | Active phase | I | Reference | Comment |
---|---|---|---|---|
Capillary | DB-5 | 1487. | Rodriques, Amorim, et al., 2013 | 30. m/0.25 mm/0.25 μm, Helium, 3. K/min; Tstart: 60. C; Tend: 240. C |
Capillary | HP-5 MS | 1482. | Sardashti, Valizadeh, et al., 2013 | 60. m/0.25 mm/0.25 μm, Helium, 40. C @ 1. min, 3. K/min, 250. C @ 20. min |
Capillary | RTX-1 | 1486. | Bendiabdellah, El Amine Dib, et al., 2012 | 60. m/0.22 mm/0.25 μm, Helium, 2. K/min, 230. C @ 5. min; Tstart: 60. C |
Capillary | DB-5 | 1492. | Boukhris, Bouaziz, et al., 2012 | 30. m/0.25 mm/0.25 μm, Helium, 100. C @ 1. min, 10. K/min, 260. C @ 10. min |
Capillary | DB-5 MS | 1492. | Cui, Yang, et al., 2011 | 30. m/0.25 mm/0.25 μm, Helium, 3. K/min; Tstart: 60. C; Tend: 270. C |
Capillary | HP-5 MS | 1485. | Feizbakhsh and Naeemy, 2011 | 30. m/0.25 mm/0.25 μm, Helium, 60. C @ 20. min, 4. K/min, 220. C @ 20. min |
Capillary | DB-5 | 1487. | Fraternale, Ricci, et al., 2011 | 30. m/0.25 mm/0.25 μm, Helium, 3. K/min; Tstart: 60. C; Tend: 240. C |
Capillary | HP-5 MS | 1477. | Hammami, Kamoun, et al., 2011 | 30. m/0.25 mm/0.25 μm, Helium, 2. K/min; Tstart: 50. C; Tend: 180. C |
Capillary | DB-5 | 1485. | Karimi, Farmani, et al., 2011 | 30. m/0.25 mm/0.25 μm, Helium, 3. K/min; Tstart: 60. C; Tend: 240. C |
Capillary | CP-Sil 5 CB | 1488. | Mothana, Hasson, et al., 2011 | 30. m/0.25 mm/0.26 μm, Nitrogen, 3. K/min, 280. C @ 22. min; Tstart: 45. C |
Capillary | DB-5 | 1487. | Osorio, Carriazo, et al., 2011 | 30. m/0.32 mm/0.25 μm, Helium, 50. C @ 4. min, 4. K/min, 300. C @ 5. min |
Capillary | RTX-1 | 1486. | Dib, Djabou, et al., 2010 | 60. m/0.22 mm/0.25 μm, Helium, 2. K/min, 230. C @ 30. min; Tstart: 60. C |
Capillary | DB-5 | 1490. | Ho, Wang, et al., 2010 | 30. m/0.25 mm/0.25 μm, Helium, 2. K/min; Tstart: 50. C; Tend: 250. C |
Capillary | DB-5 | 1485. | Magalhaes, Lima, et al., 2010 | 30. m/0.25 mm/0.25 μm, Helium, 3. K/min; Tstart: 60. C; Tend: 240. C |
Capillary | HP-5 | 1487. | Monsef-Esfahani, Miri, et al., 2010 | 30. m/0.25 mm/0.25 μm, Helium, 50. C @ 5. min, 3. K/min; Tend: 240. C |
Capillary | HP-5 MS | 1485. | Pripdeevech, Chumpolsri, et al., 2010 | 30. m/0.25 mm/0.25 μm, Helium, 2. K/min; Tstart: 100. C; Tend: 220. C |
Capillary | HP-5 MS | 1494. | Radulovic, Blagojevic, et al., 2010 | 30. m/0.25 mm/0.25 μm, Helium, 5. K/min, 290. C @ 10. min; Tstart: 70. C |
Capillary | HP-5 | 1500. | Radulovic, Dordevic, et al., 2010 | 30. m/0.25 mm/0.25 μm, Hydrogen, 5. K/min; Tstart: 70. C; Tend: 290. C |
Capillary | HP-5 MS | 1484. | Safaei-Ghomi and Batooli, 2010 | 30. m/0.25 mm/0.25 μm, Helium, 60. C @ 3. min, 6. K/min; Tend: 220. C |
Capillary | DB-5 MS | 1485. | Silva, Pott, et al., 2010 | 30. m/0.25 mm/0.25 μm, Helium, 3. K/min; Tstart: 60. C; Tend: 240. C |
Capillary | DB-5 | 1494. | de Souza, Lopes, et al., 2010 | 30. m/0.25 mm/0.25 μm, Helium, 40. C @ 1. min, 3. K/min; Tend: 240. C |
Capillary | DB-1 | 1479. | Xu, Tang, et al., 2010 | 30. m/0.25 mm/0.25 μm, Helium, 50. C @ 2. min, 4. K/min, 220. C @ 2. min |
Capillary | SE-54 | 1478. | Dayisoylu and Alma, 2009 | 30. m/0.25 mm/0.25 μm, Helium, 60. C @ 5. min, 2. K/min, 260. C @ 999. min |
Capillary | SPB-5 | 1506. | Gauvin-Bialecki and Marodon, 2009 | 60. m/0.35 mm/0.25 μm, Nitrogen, 4. K/min, 230. C @ 40. min; Tstart: 60. C |
Capillary | CP-Sil 5 CB | 1490. | Hnawia, Menut, et al., 2009 | 30. m/0.25 mm/0.25 μm, Nitrogen, 5. K/min; Tstart: 50. C; Tend: 200. C |
Capillary | DB-5 | 1490. | Ho, Wang, et al., 2009 | 30. m/0.25 mm/0.25 μm, Helium, 50. C @ 2. min, 5. K/min; Tend: 250. C |
Capillary | DB-5 | 1485. | Kazemi and Akhavani, 2009 | 50. m/0.20 mm/0.32 μm, Nitrogen, 60. C @ 3. min, 5. K/min; Tend: 220. C |
Capillary | HP-5 MS | 1480. | Kim and Chung, 2009 | 30. m/0.25 mm/0.25 μm, Helium, 35. C @ 5. min, 2. K/min, 195. C @ 30. min |
Capillary | HP-5 | 1485. | Lago, Favero, et al., 2009 | 30. m/0.32 mm/0.25 μm, Helium, 50. C @ 2. min, 5. K/min, 280. C @ 5. min |
Capillary | DB-5 | 1484. | Lawal and Oyedelji, 2009 | 30. m/0.25 mm/0.25 μm, Helium, 5. K/min; Tstart: 70. C; Tend: 240. C |
Capillary | VF-1 MS | 1485. | Marchesini, Prada, et al., 2009 | 30. m/0.25 mm/0.25 μm, Helium, 60. C @ 5. min, 4. K/min, 280. C @ 10. min |
Capillary | RTX-1 | 1483. | Museli, Pau, et al., 2009 | 60. m/0.22 mm/0.25 μm, Helium, 2. K/min, 230. C @ 30. min; Tstart: 60. C |
Capillary | RTX-1 | 1486. | Museli, Pau, et al., 2009 | 60. m/0.22 mm/0.25 μm, Helium, 2. K/min, 230. C @ 30. min; Tstart: 60. C |
Capillary | DB-5 | 1490. | Scrivanti, Anton, et al., 2009 | 30. m/0.25 mm/0.25 μm, Nitrogen, 2. K/min; Tstart: 40. C; Tend: 230. C |
Capillary | DB-5 | 1490. | Shafaghat and Sadeghi, 2009 | 50. m/0.20 mm/0.32 μm, Nitrogen, 60. C @ 3. min, 5. K/min, 220. C @ 5. min |
Capillary | DB-5 MS | 1482. | Shimizu, Imayoshi, et al., 2009 | 30. m/0.25 mm/0.25 μm, Helium, 50. C @ 2. min, 3. K/min, 220. C @ 70. min |
Capillary | DB-5 | 1494. | de Souza, Lopes, et al., 2009 | 30. m/0.25 mm/0.25 μm, Helium, 40. C @ 1. min, 3. K/min; Tend: 240. C |
Capillary | HP-5 MS | 1490. | Zhao, Zeng, et al., 2009 | 30. m/0.25 mm/0.25 μm, Helium, 4. K/min; Tstart: 50. C; Tend: 280. C |
Capillary | HP-5 | 1485. | Aicha, Ines, et al., 2008 | 30. m/0.25 mm/0.25 μm, Helium, 50. C @ 3. min, 9. K/min, 280. C @ 3. min |
Capillary | HP-5 MS | 1492. | Bouwmeester, de Kraker, et al., 2008 | 30. m/0.25 mm/0.25 μm, Helium, 70. C @ 1. min, 5. K/min, 210. C @ 5. min |
Capillary | DB-5 | 1464. | Khokra, Prakash, et al., 2008 | 30. m/0.25 mm/0.25 μm, Helium, 100. C @ 2. min, 20. K/min, 300. C @ 10. min |
Capillary | DB-5 | 1473. | Khokra, Prakash, et al., 2008 | 30. m/0.25 mm/0.25 μm, Helium, 100. C @ 2. min, 20. K/min, 300. C @ 10. min |
Capillary | DB-5 MS | 1483. | Noudogbessi, Yedomonhan, et al., 2008 | 30. m/0.25 mm/0.25 μm, Helium, 50. C @ 5. min, 5. K/min, 300. C @ 5. min |
Capillary | Elite-1 | 1480. | Raj, Baby, et al., 2008 | 30. m/0.32 mm/0.25 μm, Helium, 3. K/min; Tstart: 60. C; Tend: 246. C |
Capillary | HP-5 | 1485. | Yassa and Akhani, 2008 | 30. m/0.25 mm/0.32 μm, Helium, 60. C @ 30. min, 5. K/min; Tend: 250. C |
Capillary | HP-5 MS | 1485. | Adams, Beauchamp, et al., 2007 | 30. m/0.25 mm/0.25 μm, Helium, 50. C @ 10. min, 3. K/min, 230. C @ 10. min |
Capillary | DB-5 | 1484. | Amiri, 2007 | 50. m/0.20 mm/0.32 μm, Nitrogen, 60. C @ 3. min, 5. K/min, 220. C @ 5. min |
Capillary | CP Sil 5 CB | 1482. | Baran, von Reuss, et al., 2007 | 30. m/0.32 mm/0.25 μm, N2, 4. K/min; Tstart: 60. C; Tend: 300. C |
Capillary | HP-5 MS | 1489. | Capetanos, Saroglou, et al., 2007 | 30. m/0.32 mm/0.25 μm, Helium, 60. C @ 5. min, 4. K/min; Tend: 280. C |
Capillary | DB-5MS | 1488. | Da Silva J.K.R., Sousa P.J.C., et al., 2007 | 30. m/0.25 mm/0.25 μm, He, 3. K/min; Tstart: 60. C; Tend: 240. C |
Capillary | HP-5 | 1488. | Farsam, Amanlou, et al., 2007 | 30. m/0.25 mm/0.26 μm, Helium, 60. C @ 2. min, 4. K/min, 240. C @ 20. min |
Capillary | HP-1 | 1476. | Hachicha, Skanji, et al., 2007 | 30. m/0.25 mm/0.25 μm, He, 2. K/min, 240. C @ 20. min; Tstart: 60. C |
Capillary | HP-101 | 1442. | Jerkovic, Mastelic, et al., 2007 | 25. m/0.2 mm/0.2 μm, He, 70. C @ 2. min, 3. K/min; Tend: 200. C |
Capillary | SE-30 | 1484. | Loizzo, Tundis, et al., 2007 | 30. m/0.25 mm/0.25 μm, He, 40. C @ 5. min, 5. K/min, 250. C @ 10. min |
Capillary | HP-5 | 1482. | Loizzo, Tundis, et al., 2007 | 30. m/0.25 mm/0.25 μm, He, 40. C @ 5. min, 5. K/min, 250. C @ 10. min |
Capillary | ZB-5 | 1487. | Mohottalage, Tabacchi, et al., 2007 | 30. m/0.25 mm/0.25 μm, 60. C @ 5. min, 4. K/min, 220. C @ 20. min |
Capillary | DB-5 | 1456. | Moreno, Lima, et al., 2007 | 30. m/0.25 mm/0.25 μm, Helium, 3. K/min; Tstart: 60. C; Tend: 300. C |
Capillary | DB-5 | 1492. | Morteza-Semnani, Saeedi, et al., 2007 | 30. m/0.25 mm/0.25 μm, Helium, 4. K/min; Tstart: 60. C; Tend: 220. C |
Capillary | HP-5 | 1486. | Oliveira, Leitão, et al., 2007 | 25. m/0.2 mm/0.33 μm, H2, 3. K/min; Tstart: 60. C; Tend: 240. C |
Capillary | DB-1 | 1482. | Ouattara, Koudou, et al., 2007 | 30. m/0.25 mm/0.15 μm, 3. K/min; Tstart: 60. C; Tend: 220. C |
Capillary | Methyl Silicone | 1490. | Ozcan and Chalchat, 2007 | Helium, 3. K/min; Column length: 50. m; Column diameter: 0.25 mm; Tstart: 50. C; Tend: 240. C |
Capillary | DB-1 | 1490. | Pala-Paul, Brophy, et al., 2007 | 50. m/0.25 mm/0.25 μm, He, 4. K/min; Tstart: 95. C; Tend: 240. C |
Capillary | HP-5 MS | 1490. | Phutdhawong, Kawaree, et al., 2007 | 25. m/0.25 mm/0.25 μm, Helium, 100. C @ 3. min, 4. K/min, 280. C @ 5. min |
Capillary | SPB-1 | 1469. | Pinto, Salgueiro, et al., 2007 | 30. m/0.2 mm/0.2 μm, He, 3. K/min, 220. C @ 15. min; Tstart: 70. C |
Capillary | HP-5 MS | 1489. | Rojas, Velasco, et al., 2007 | 60. m/0.25 mm/0.25 μm, Hydrogen, 4. K/min, 260. C @ 20. min; Tstart: 60. C |
Capillary | HP-5 | 1485. | Yassa and Akhani, 2007 | 30. m/0.25 mm/0.32 μm, He, 60. C @ 30. min, 5. K/min; Tend: 250. C |
Capillary | HP-5 | 1482. | Abdelwahed, Hayder, et al., 2006 | 30. m/0.25 mm/0.25 μm, N2, 50. C @ 3. min, 9. K/min, 280. C @ 3. min |
Capillary | HP-5 | 1485. | Abdelwahed, Hayder, et al., 2006 | 30. m/0.25 mm/0.25 μm, N2, 50. C @ 3. min, 9. K/min, 280. C @ 3. min |
Capillary | DB-5 | 1471. | Apel, Sobral, et al., 2006 | 30. m/0.25 mm/0.25 μm, He, 3. K/min; Tstart: 60. C; Tend: 300. C |
Capillary | AT-5 | 1488. | Borges, Rojas, et al., 2006 | 60. m/0.25 mm/0.25 μm, He, 4. K/min, 200. C @ 20. min; Tstart: 60. C |
Capillary | BP-1 | 1475. | Boti, Muselli, et al., 2006 | 50. m/0.22 mm/0.25 μm, He, 2. K/min, 220. C @ 20. min; Tstart: 60. C |
Capillary | BP-1 | 1484. | Boti, Yao, et al., 2006 | 50. m/0.22 mm/0.25 μm, 2. K/min, 220. C @ 20. min; Tstart: 60. C |
Capillary | HP-5MS | 1486. | Bozin, Mimicá-Dukic, et al., 2006 | 30. m/0.25 mm/0.25 μm, He, 3. K/min; Tstart: 60. C; Tend: 280. C |
Capillary | HP-1 | 1482. | Castel, Fernandez, et al., 2006 | 50. m/0.2 mm/0.5 μm, He, 2. K/min, 250. C @ 120. min; Tstart: 60. C |
Capillary | DB-1 | 1476. | Chen, Sheu, et al., 2006 | Nitrogen, 40. C @ 1. min, 2. K/min, 200. C @ 9. min; Column length: 60. m; Column diameter: 0.25 mm |
Capillary | DB-5 | 1493. | Damjanovic, Skala, et al., 2006 | 30. m/0.32 mm/0.25 μm, 3. K/min, 230. C @ 15. min; Tstart: 60. C |
Capillary | HP-1 | 1490. | Fernandez, Pintaric, et al., 2006 | 50. m/0.2 mm/0.33 μm, He, 2. K/min, 250. C @ 60. min; Tstart: 60. C |
Capillary | DB-1 | 1531. | Gohari, Hadjiakhoondi, et al., 2006 | 60. m/0.25 mm/0.25 μm, He, 60. C @ 2. min, 5. K/min; Tend: 240. C |
Capillary | DB-5 | 1485. | Gohari, Hadjiakhoondi, et al., 2006 | 30. m/0.25 mm/0.25 μm, He, 60. C @ 2. min, 5. K/min; Tend: 240. C |
Capillary | DB-5 | 1485. | Gohari A.R., Hadjiakhoondi A., et al., 2006 | 30. m/0.25 mm/0.25 μm, He, 60. C @ 2. min, 5. K/min; Tend: 240. C |
Capillary | CP Sil 5 CB | 1490. | Hymete, Rohloff, et al., 2006 | 30. m/0.25 mm/0.25 μm, 3. K/min, 220. C @ 3. min; Tstart: 40. C |
Capillary | HP-5 | 1485. | Ibañez and Usubillaga, 2006 | 30. m/0.25 mm/0.25 μm, He, 4. K/min; Tstart: 60. C; Tend: 240. C |
Capillary | HP-5MS | 1485. | Ibanez and Usubillaga, 2006 | 30. m/0.25 mm/0.25 μm, He, 4. K/min; Tstart: 60. C; Tend: 260. C |
Capillary | RTX-1 | 1486. | Kula, Izydorczyk, et al., 2006 | 30. m/0.32 mm/0.25 μm, He, 4. K/min; Tstart: 60. C; Tend: 300. C |
Capillary | BP-1 | 1484. | Lesueur, Ban, et al., 2006 | 50. m/0.22 mm/0.25 μm, He, 2. K/min, 220. C @ 20. min; Tstart: 60. C |
Capillary | CP Sil 5 CB | 1491. | Martin, Joseph, et al., 2006 | 30. m/0.25 mm/0.25 μm, N2, 5. K/min; Tstart: 50. C; Tend: 200. C |
Capillary | HP-5 | 1479. | Miyazawa and Kawata, 2006 | 30. m/0.32 mm/0.25 μm, Helium, 4. K/min, 240. C @ 5. min; Tstart: 40. C |
Capillary | BP-1 | 1479. | Moody, Gundidza, et al., 2006 | He, 70. C @ 2. min, 4. K/min, 220. C @ 10. min; Column length: 25. m; Column diameter: 0.3 mm |
Capillary | DB-5 | 1493. | Morteza-Semnani, Akbarzadeh, et al., 2006 | 30. m/0.25 mm/0.25 μm, He, 4. K/min; Tstart: 60. C; Tend: 220. C |
Capillary | DB-5 | 1494. | Morteza-Semnani K., Akbarzadeh M., et al., 2006 | 30. m/0.25 mm/0.25 μm, He, 60. C @ 5. min, 4. K/min; Tend: 220. C |
Capillary | HP-5 | 1489. | Potzernheim, Bizzo, et al., 2006 | 25. m/0.32 mm/0.25 μm, H2, 3. K/min; Tstart: 60. C; Tend: 240. C |
Capillary | DB-5 | 1484. | Senatore, Landolfi, et al., 2006 | 30. m/0.25 mm/0.25 μm, He, 40. C @ 5. min, 2. K/min, 260. C @ 20. min |
Capillary | HP-5 | 1502. | Shafi, Jose, et al., 2006 | 25. m/0.2 mm/0.33 μm, N2, 3. K/min; Tstart: 30. C; Tend: 280. C |
Capillary | CP Sil 5 CB | 1488. | Tesso, König, et al., 2006 | H2, 3. K/min; Column length: 25. m; Column diameter: 0.25 mm; Tstart: 50. C; Tend: 230. C |
Capillary | DB-5 | 1484. | Trilles, Bombarda, et al., 2006 | 30. m/0.25 mm/0.25 μm, N2, 4. K/min; Tstart: 60. C; Tend: 240. C |
Capillary | SPB-1 | 1476. | Wong, Lim, et al., 2006 | 50. m/0.2 mm/0.33 μm, He, 50. C @ 1. min, 4. K/min, 220. C @ 10. min |
Capillary | SPB-1 | 1464. | Wong, Sivasothy, et al., 2006 | 30. m/0.25 mm/0.25 μm, He, 50. C @ 1. min, 4. K/min, 250. C @ 10. min |
Capillary | HP-5MS | 1492. | Asadipour, Mehrabani, et al., 2005 | 30. m/0.25 mm/0.25 μm, He, 4. K/min; Tstart: 60. C; Tend: 275. C |
Capillary | DB-5 | 1484. | Chagonda and Chalchat, 2005 | 50. m/0.3 mm/0.25 μm, 2. K/min; Tstart: 60. C; Tend: 240. C |
Capillary | DB-5 | 1472. | Chagonda and Chalchat, 2005, 2 | 25. m/0.25 mm/0.15 μm, 40. C @ 5. min, 3. K/min; Tend: 220. C |
Capillary | DB-5 | 1483. | Chaverri and Cicció, 2005 | 30. m/0.25 mm/0.25 μm, He, 3. K/min; Tstart: 60. C; Tend: 240. C |
Capillary | DB-5 | 1484. | Chaverri and Cicció, 2005 | 30. m/0.25 mm/0.25 μm, He, 3. K/min; Tstart: 60. C; Tend: 240. C |
Capillary | SPB-5 | 1527. | Cornu, Kondjoyan, et al., 2005 | 60. m/0.32 mm/1. μm, He, 40. C @ 5. min, 3. K/min; Tend: 230. C |
Capillary | DB-1 | 1480. | Facundo, Pinto, et al., 2005 | 30. m/0.25 mm/0.25 μm, He, 60. C @ 5. min, 5. K/min, 250. C @ 15. min |
Capillary | DB-1 | 1496. | Fakhari A.R., Sonboli A., et al., 2005 | 60. m/0.25 mm/0.25 μm, N2, 5. K/min, 250. C @ 10. min; Tstart: 60. C |
Capillary | DB-5 | 1478. | Ferraz, Limberger, et al., 2005 | 30. m/0.25 mm/0.25 μm, He, 60. C @ 3. min, 3. K/min; Tend: 300. C |
Capillary | HP-5MS | 1476. | Gauvin and Smadja, 2005 | 30. m/0.25 mm/0.25 μm, He, 60. C @ 30. min, 4. K/min; Tend: 200. C |
Capillary | HP-5MS | 1484. | Ghasemi Y., Faridi P., et al., 2005 | He, 50. C @ 3. min, 3. K/min, 250. C @ 10. min; Column length: 25. m; Column diameter: 0.25 mm |
Capillary | DB-5 | 1490. | Morteza-Semnani and Saeedi, 2005 | 30. m/0.25 mm/0.25 μm, He, 60. C @ 4. min, 4. K/min; Tend: 220. C |
Capillary | DB-5 | 1493. | Morteza-Semnani and Saeedi, 2005, 2 | 30. m/0.25 mm/0.25 μm, He, 60. C @ 4. min, 4. K/min; Tend: 220. C |
Capillary | HP-5 | 1494. | Oyedeji, Yani, et al., 2005 | 30. m/0.25 mm/0.25 μm, He, 5. K/min; Tstart: 70. C; Tend: 240. C |
Capillary | DB-1 | 1490. | Palá-Paúl, Pérez-Alonso, et al., 2005 | 50. m/0.25 mm/0.25 μm, N2, 4. K/min; Tstart: 95. C; Tend: 240. C |
Capillary | HP-5MS | 1490. | Petrakis, Roussis, et al., 2005 | 3. K/min; Column length: 30. m; Column diameter: 0.2 mm; Tstart: 60. C; Tend: 280. C |
Capillary | HP-5MS | 1496. | Pourmortazavi, Ghadiri, et al., 2005 | 30. m/0.25 mm/0.32 μm, He, 60. C @ 3. min, 5. K/min; Tend: 250. C |
Capillary | HP-5MS | 1484. | Sajjadi and Ghannadi, 2005 | 30. m/0.25 mm/0.25 μm, He, 4. K/min; Tstart: 60. C; Tend: 275. C |
Capillary | DB-1 | 1467. | Sarkhail, Amin, et al., 2005 | 30. m/0.25 mm/0.25 μm, He, 50. C @ 1. min, 2.5 K/min, 265. C @ 20. min |
Capillary | DB-5 | 1483. | Sefidkon and Jamzad, 2005 | He, 4. K/min; Column length: 30. m; Column diameter: 0.25 mm; Tstart: 40. C; Tend: 240. C |
Capillary | DB-5 | 1484. | Senatore, Apostolides Arnold, et al., 2005 | 30. m/0.25 mm/0.25 μm, He, 40. C @ 5. min, 2. K/min, 260. C @ 20. min |
Capillary | HP-5MS | 1486. | Setzer, Noletto, et al., 2005 | 30. m/0.25 mm/0.25 μm, He, 60. C @ 5. min, 3. K/min; Tend: 280. C |
Capillary | DB-5 | 1478. | Simoes-Pires C.A., Debenedetti S., et al., 2005 | 30. m/0.25 mm/0.25 μm, He, 3. K/min; Tstart: 60. C; Tend: 300. C |
Capillary | RTX-1 | 1489. | Sonboli, Salehi, et al., 2005 | 60. m/0.25 mm/0.25 μm, He, 5. K/min, 25. C @ 10. min; Tstart: 60. C |
Capillary | DB-5 | 1452. | Tzakou and Constantinidis, 2005 | 30. m/0.32 mm/0.25 μm, He, 3. K/min; Tstart: 60. C; Tend: 280. C |
Capillary | HP-5 | 1488. | Utsunomia, Kawata, et al., 2005 | 30. m/0.32 mm/0.25 μm, Helium, 4. K/min, 300. C @ 5. min; Tstart: 40. C |
Capillary | DB-5MS | 1488. | Watanabe Y., Mihara R., et al., 2005 | 30. m/0.25 mm/0.25 μm, He, 80. C @ 2. min, 5. K/min, 250. C @ 9. min |
Capillary | BP-1 | 1483. | Blanc, Muselli, et al., 2004 | 50. m/0.22 mm/0.25 μm, 2. K/min, 220. C @ 20. min; Tstart: 60. C |
Capillary | DB-1 | 1489. | Fekam Boyom, Fotio, et al., 2004 | 30. m/0.25 mm/0.25 μm, N2, 5. K/min; Tstart: 50. C; Tend: 200. C |
Capillary | DB-1 | 1485. | bin Jantan, Ayop, et al., 2004 | 25. m/0.25 mm/0.25 μm, 60. C @ 10. min, 3. K/min, 180. C @ 10. min |
Capillary | ZB-5 | 1516. | Jürgens and Dötterl, 2004 | 60. m/0.25 mm/0.25 μm, He, 40. C @ 4.6 min, 6. K/min, 260. C @ 1. min |
Capillary | DB-5 | 1485. | Kalvandi, Sefidkon, et al., 2004 | 60. m/0.25 mm/0.25 μm, He, 40. C @ 4. min, 4. K/min; Tend: 280. C |
Capillary | RTX-1 | 1484. | Kalemba and Thiem, 2004 | 30. m/0.25 mm/0.25 μm, N2, 4. K/min; Tstart: 60. C; Tend: 300. C |
Capillary | SE-54 | 1478. | Kilic, Hafizoglu, et al., 2004 | 30. m/0.25 mm/0.25 μm, He, 60. C @ 5. min, 2. K/min; Tend: 260. C |
Capillary | DB-5 | 1466. | Lago, de Ávila, et al., 2004 | 30. m/0.25 mm/0.25 μm, He, 3. K/min; Tstart: 60. C; Tend: 300. C |
Capillary | DB-5MS | 1485. | paz Lima, Silva, et al., 2004 | 30. m/0.25 mm/0.25 μm, He, 3. K/min; Tstart: 60. C; Tend: 240. C |
Capillary | DB-5 | 1471. | Limberger, Sobral, et al., 2004 | 30. m/0.25 mm/0.25 μm, He, 3. K/min; Tstart: 60. C; Tend: 300. C |
Capillary | DB-5MS | 1452. | Marongiu, Porcedda, et al., 2004 | 30. m/0.25 mm/0.25 μm, He, 3. K/min, 280. C @ 30. min; Tstart: 60. C |
Capillary | HP-5MS | 1488. | Mehrabani, Asadipour, et al., 2004 | 30. m/0.25 mm/0.25 μm, He, 4. K/min; Tstart: 60. C; Tend: 275. C |
Capillary | DB-5 | 1478. | Mevy, Bessiere, et al., 2004 | 30. m/0.25 mm/0.15 μm, 60. C @ 3. min, 3. K/min; Tend: 220. C |
Capillary | HP-5MS | 1486. | Mimica-Dukic, Bozin, et al., 2004 | 30. m/0.25 mm/0.25 μm, He, 3. K/min; Tstart: 60. C; Tend: 280. C |
Capillary | DB-5 | 1481. | Miyazawa, Fuhita, et al., 2004 | Helium, 2. K/min, 240. C @ 999. min; Column length: 30. m; Column diameter: 0.25 mm; Tstart: 60. C |
Capillary | DB-5 | 1481. | Miyazawa, Fujita, et al., 2004 | Helium, 2. K/min, 240. C @ 999. min; Column length: 50. m; Column diameter: 0.25 mm; Tstart: 60. C |
Capillary | NB-30 | 1484. | Orav, Stulova, et al., 2004 | 50. m/0.2 mm/0.25 μm, He, 2. K/min; Tstart: 50. C; Tend: 250. C |
Capillary | NB-30 | 1484. | Orav, Stulova, et al., 2004 | 50. m/0.2 mm/0.25 μm, He, 2. K/min; Tstart: 50. C; Tend: 250. C |
Capillary | HP-5 | 1497. | Shafi, Nambiar, et al., 2004 | 25. m/0.2 mm/0.5 μm, N2, 3. K/min; Tstart: 30. C; Tend: 280. C |
Capillary | HP-5 | 1490. | Simic, Sokovic, et al., 2004 | 25. m/0.32 mm/0.52 μm, H2, 4. K/min; Tstart: 40. C; Tend: 240. C |
Capillary | DB-5 | 1478. | Suyenaga, Apel, et al., 2004 | 30. m/0.25 mm/0.25 μm, 3. K/min; Tstart: 60. C; Tend: 300. C |
Capillary | DB-5 | 1487. | Cabanillas, Lopez, et al., 2003 | 30. m/0.25 mm/0.25 μm, He, 4. K/min; Tstart: 60. C; Tend: 240. C |
Capillary | HP-5MS | 1483. | Couladis, Özcan, et al., 2003 | 30. m/0.25 mm/0.25 μm, He, 3. K/min; Tstart: 60. C; Tend: 280. C |
Capillary | HP-5MS | 1494. | Feizbaksh, Saber Tehrani, et al., 2003 | 30. m/0.25 mm/0.25 μm, He, 60. C @ 20. min, 5. K/min, 220. C @ 20. min |
Capillary | DB-1 | 1497. | Fekam Boyom, Ngouana, et al., 2003 | 30. m/0.25 mm/0.25 μm, N2, 5. K/min; Tstart: 50. C; Tend: 200. C |
Capillary | HP-5MS | 1485. | Ghasemi, Asghari, et al., 2003 | 30. m/0.25 mm/0.25 μm, He, 4. K/min; Tstart: 60. C; Tend: 280. C |
Capillary | RSL-200 | 1485. | Jirovetz, Buchbauer, et al., 2003 | 30. m/0.32 mm/0.25 μm, H2, 40. C @ 5. min, 6. K/min, 280. C @ 5. min |
Capillary | RSL-200 | 1477. | Jirovetz, Buchbauer, et al., 2003, 2 | 30. m/0.32 mm/0.25 μm, H2, 40. C @ 5. min, 6. K/min, 280. C @ 5. min |
Capillary | DB-5 | 1488. | Juteau, Jerkovic, et al., 2003 | 50. m/0.2 mm/0.25 μm, He, 50. C @ 2. min, 3. K/min, 220. C @ 10. min |
Capillary | DB-5 | 1481. | Limberger, Simões-Pires, et al., 2003 | 30. m/0.25 mm/0.25 μm, He, 3. K/min; Tstart: 60. C; Tend: 250. C |
Capillary | DB-1 | 1464. | Mahalwal and Ali, 2003 | 30. m/0.25 mm/0.25 μm, N2, 4. K/min; Tstart: 80. C; Tend: 250. C |
Capillary | DB-5MS | 1486. | Maia, Taveira, et al., 2003 | 30. m/0.25 mm/0.25 μm, He, 3. K/min; Tstart: 60. C; Tend: 240. C |
Capillary | DB-5 | 1478. | Marongiu, Porcedda, et al., 2003 | 30. m/0.25 mm/0.25 μm, He, 3. K/min, 280. C @ 30. min; Tstart: 60. C |
Capillary | DB-5 | 1489. | Masotti, Juteau, et al., 2003 | 50. m/0.2 mm/0.25 μm, He, 50. C @ 2. min, 3. K/min; Tend: 220. C |
Capillary | ZB-1 | 1478. | Mierendorff, Stahl-Biskup, et al., 2003 | 30. m/0.25 mm/0.25 μm, N2, 3. K/min; Tstart: 45. C; Tend: 230. C |
Capillary | DB-1 | 1478. | Mirza and Nik, 2003 | 60. m/0.25 mm/0.25 μm, He, 4. K/min; Tstart: 50. C; Tend: 270. C |
Capillary | HP-5 | 1466. | Pitarokili, Tzakou, et al., 2003 | 30. m/0.25 mm/0.25 μm, He, 3. K/min; Tstart: 60. C; Tend: 280. C |
Capillary | HP-5 | 1487. | Sajjadi and Mehregan, 2003 | 30. m/0.25 mm/0.25 μm, He, 4. K/min; Tstart: 60. C; Tend: 280. C |
Capillary | DB-1 | 1480. | Shahmir, Ahmadi, et al., 2003 | 60. m/0.25 mm/0.25 μm, He, 4. K/min; Tstart: 50. C; Tend: 280. C |
Capillary | DB-5 | 1490. | da Silva, Luz, et al., 2003 | 30. m/0.25 mm/0.25 μm, He, 3. K/min; Tstart: 60. C; Tend: 240. C |
Capillary | CP Sil 5 CB | 1478. | Taiwo and Bolanle, 2003 | 25. m/0.25 mm/0.15 μm, 3. K/min; Tstart: 50. C; Tend: 230. C |
Capillary | DB-5MS | 1483. | Taveira, de Lima, et al., 2003 | 30. m/0.25 mm/0.25 μm, He, 3. K/min; Tstart: 60. C; Tend: 240. C |
Capillary | HP-5 | 1485. | Yassa, Akhani, et al., 2003 | 30. m/0.25 mm/0.32 μm, He, 60. C @ 30. min, 5. K/min; Tend: 250. C |
Capillary | DB-5 | 1484. | Zoghbi, Andrade, et al., 2003 | 30. m/0.25 mm/0.25 μm, He, 3. K/min; Tstart: 60. C; Tend: 240. C |
Capillary | OV-101 | 1496. | Boyom, Keumedjio, et al., 2002 | 5. K/min; Column length: 25. m; Column diameter: 0.32 mm; Tstart: 50. C; Tend: 200. C |
Capillary | DB-5 | 1476. | Caredda, Marongiu, et al., 2002 | 30. m/0.25 mm/0.25 μm, He, 3. K/min, 280. C @ 30. min; Tstart: 60. C |
Capillary | 5 % Phenyl methyl siloxane | 1490. | Cicció and Gómez-Laurito, 2002 | 30. m/0.25 mm/0.25 μm, He, 75. C @ 4. min, 3. K/min, 200. C @ 8. min |
Capillary | DB-5MS | 1490. | Congiu, Falconieri, et al., 2002 | 30. m/0.25 mm/0.25 μm, He, 3. K/min; Tstart: 60. C; Tend: 280. C |
Capillary | DB-5MS | 1490. | Congiu, Falconieri, et al., 2002 | 30. m/0.25 mm/0.25 μm, He, 3. K/min; Tstart: 60. C; Tend: 280. C |
Capillary | HP-5 | 1494. | Farah, Fechtal. M., et al., 2002 | 30. m/0.25 mm/0.25 μm, N2, 50. C @ 5. min, 4. K/min; Tend: 250. C |
Capillary | DB-5 | 1487. | Flamini, Ertugrul, et al., 2002 | 30. m/0.25 mm/0.25 μm, He, 3. K/min; Tstart: 60. C; Tend: 240. C |
Capillary | DB-5 | 1491. | Kabouss, Charrouf, et al., 2002 | 30. m/0.25 mm/0.25 μm, 40. C @ 2. min, 2. K/min, 210. C @ 33. min |
Capillary | DB-5 | 1485. | Kobaisy, Tellez, et al., 2002 | 30. m/0.25 mm/0.25 μm, He, 3. K/min; Tstart: 60. C; Tend: 240. C |
Capillary | DB-5 | 1495. | Krauze-Baranowska, Mardarowicz, et al., 2002 | 30. m/0.25 mm/0.25 μm, He, 35. C @ 2. min, 3. K/min, 280. C @ 15. min |
Capillary | OV-101 | 1493. | Kuiate, Bessière, et al., 2002 | He, 5. K/min; Column length: 25. m; Column diameter: 0.32 mm; Tstart: 50. C; Tend: 200. C |
Capillary | DB-5 | 1481. | Limberger, Simões-Pires, et al., 2002 | 30. m/0.25 mm/0.25 μm, He, 3. K/min; Tstart: 60. C; Tend: 250. C |
Capillary | DB-5 | 1493. | Lin, Rouseff, et al., 2002 | 30. m/0.32 mm/0.25 μm, He, 7. K/min; Tstart: 40. C; Tend: 290. C |
Capillary | DB-5 | 1486. | Maia, da Silva, et al., 2002 | 30. m/0.25 mm/0.25 μm, He, 3. K/min; Tstart: 60. C; Tend: 240. C |
Capillary | DB-5MS | 1488. | Maia, Zoghbi, et al., 2002 | 30. m/0.25 mm/0.25 μm, He, 3. K/min; Tstart: 60. C; Tend: 240. C |
Capillary | DB-1 | 1491. | Norouzi-Arasi, Yavari, et al., 2002 | 30. m/0.25 mm/0.25 μm, He, 60. C @ 10. min, 4. K/min; Tend: 250. C |
Capillary | HP-1 | 1479. | Priestap, van Baren, et al., 2002 | 50. m/0.25 mm/0.25 μm, N2, 3. K/min; Tstart: 90. C; Tend: 220. C |
Capillary | DB-5 | 1477. | Ruberto, Biondi, et al., 2002 | 30. m/0.25 mm/0.25 μm, He, 2. K/min; Tstart: 60. C; Tend: 300. C |
Capillary | DB-5 | 1492. | Schwob, Bessière, et al., 2002 | He, 3. K/min; Column length: 25. m; Column diameter: 0.2 mm; Tstart: 60. C; Tend: 220. C |
Capillary | DB-1 | 1459. | Velasco-Negueruela, Pérez-Alonso, et al., 2002 | 50. m/0.25 mm/0.25 μm, N2, 3. K/min; Tstart: 60. C; Tend: 240. C |
Capillary | DB-5MS | 1488. | Zoghbi, Andrade, et al., 2002 | 30. m/0.25 mm/0.25 μm, He, 3. K/min; Tstart: 60. C; Tend: 270. C |
Capillary | DB-5 | 1485. | Zoghbi, Andrade, et al., 2002, 2 | 30. m/0.25 mm/0.25 μm, He, 3. K/min; Tstart: 60. C; Tend: 240. C |
Capillary | DB-1 | 1493. | Bailac, Dellacasa, et al., 2001 | 60. m/0.248 mm/0.25 μm, N2, 60. C @ 5. min, 3. K/min, 220. C @ 22. min |
Capillary | HP-5 | 1485. | Campeol, Flamini, et al., 2001 | 30. m/0.25 mm/0.25 μm, N2, 60. C @ 10. min, 5. K/min; Tend: 220. C |
Capillary | HP-5 | 1487. | Flamini, Cioni, et al., 2001 | 30. m/0.25 mm/0.25 μm, N2, 60. C @ 10. min, 5. K/min; Tend: 220. C |
Capillary | RSL-200 | 1479. | Jirovetz L., Buchbauer G., et al., 2001 | 30. m/0.32 mm/0.25 μm, H2, 40. C @ 5. min, 6. K/min, 280. C @ 5. min |
Capillary | RTX-1 | 1485. | Kalemba, Marschall, et al., 2001 | 30. m/0.25 mm/0.25 μm, N2, 4. K/min; Tstart: 60. C; Tend: 300. C |
Capillary | DB-5 | 1486. | Palmeira, Conserva, et al., 2001 | 30. m/0.25 mm/0.25 μm, He, 3. K/min; Tstart: 60. C; Tend: 270. C |
Capillary | DB-5 | 1484. | Tellez M., Estell R., et al., 2001 | 30. m/0.25 mm/0.25 μm, He, 3. K/min; Tstart: 60. C; Tend: 240. C |
Capillary | DB-1 | 1498. | Feger, Brandauer, et al., 2000 | 33. m/0.25 mm/0.50 μm, N2, 50. C @ 2. min, 20. K/min; Tend: 135. C |
Capillary | OV-101 | 1490. | Tamura, Boonbumrung, et al., 2000 | Nitrogen, 40. C @ 10. min, 2. K/min; Column length: 50. m; Column diameter: 0.25 mm; Tend: 200. C |
Capillary | DB-5 | 1485. | Tellez, Dayan, et al., 2000 | 30. m/0.25 mm/0.25 μm, He, 3. K/min; Tstart: 60. C; Tend: 240. C |
Capillary | SE-30 | 1467. | Ali N.A.M. and Jantan, 1999 | He, 3. K/min; Column length: 25. m; Column diameter: 0.2 mm; Tstart: 60. C; Tend: 230. C |
Capillary | SE-30 | 1467. | Mohd and Jantan, 1999 | He, 60. C @ 10. min, 3. K/min; Column length: 25. m; Column diameter: 0.2 mm; Tend: 230. C |
Capillary | CP Sil 5 CB | 1479. | Oyedeji, Olawore, et al., 1999 | He, 3. K/min; Column length: 25. m; Column diameter: 0.25 mm; Tstart: 50. C; Tend: 230. C |
Capillary | DB-5 | 1484. | Porta, Porcedda, et al., 1999 | 30. m/0.25 mm/0.25 μm, He, 40. C @ 5. min, 2. K/min, 250. C @ 60. min |
Capillary | DB-5 | 1485. | Tellez, Canel, et al., 1999 | 30. m/0.25 mm/0.25 μm, He, 3. K/min; Tstart: 60. C; Tend: 240. C |
Capillary | CP Sil 5 CB | 1488. | Weyerstahl, Marschall, et al., 1999, 2 | N2, 5. K/min; Column length: 25. m; Phase thickness: 0.39 μm; Tstart: 60. C; Tend: 220. C |
Capillary | DB-5MS | 1495. | Zoghbi, Andrade, et al., 1999 | 30. m/0.25 mm/0.25 μm, He, 3. K/min; Tstart: 60. C; Tend: 240. C |
Capillary | SPB-5 | 1496. | Doneanu and Anitescu, 1998 | 50. m/0.32 mm/0.25 μm, He, 3. K/min, 240. C @ 20. min; Tstart: 60. C |
Capillary | DB-5 | 1486. | Maia, Zohhbi, et al., 1998 | 30. m/0.25 mm/0.25 μm, He, 3. K/min; Tstart: 60. C; Tend: 240. C |
Capillary | DB-5 | 1488. | Santos, Andrade, et al., 1998 | 30. m/0.25 mm/0.25 μm, Helium, 3. K/min; Tstart: 60. C; Tend: 240. C |
Capillary | DB-5 | 1496. | Elias, Simoneit, et al., 1997 | 30. m/0.25 mm/0.25 μm, He, 65. C @ 2. min, 4. K/min; Tend: 300. C |
Capillary | DB-5 | 1440. | Reverchon, Porta, et al., 1997 | 30. m/0.25 mm/0.25 μm, He, 50. C @ 5. min, 2. K/min; Tend: 250. C |
Capillary | DB-5 | 1485. | Tellez, Estell, et al., 1997 | 30. m/0.25 mm/0.25 μm, Helium, 3. K/min; Tstart: 60. C; Tend: 240. C |
Capillary | CBP-1 | 1467. | Zygadlo, Ariza-Espinar, et al., 1997 | He, 5. K/min; Column length: 25. m; Column diameter: 0.22 mm; Tstart: 60. C; Tend: 240. C |
Capillary | OV-101 | 1473. | Chacko, Jayalekshmy, et al., 1996 | 50. m/0.25 mm/0.17 μm, N2, 5. K/min; Tstart: 50. C; Tend: 220. C |
Capillary | DB-5 | 1482.2 | Gawdzik, Mardarowicz, et al., 1996 | 30. m/0.25 mm/0.25 μm, 60. C @ 2. min, 4. K/min, 300. C @ 5. min |
Capillary | DB-1 | 1464. | Stashenko, Puertas, et al., 1996 | 60. m/0.25 mm/0.25 μm, He, 50. C @ 5. min, 2.5 K/min; Tend: 250. C |
Capillary | SPB-1 | 1487. | Wong and Lai, 1996 | 50. m/0.2 mm/0.33 μm, He, 40. C @ 3. min, 3. K/min, 200. C @ 30. min |
Capillary | DB-1 | 1480. | Binder and French, 1994 | 4. K/min, 230. C @ 10. min; Column length: 60. m; Column diameter: 0.32 mm; Tstart: 50. C |
Capillary | OV-1 | 1485. | Ramanoelina, Viano, et al., 1994 | 50. m/0.27 mm/0.2 μm, N2, 3. K/min; Tstart: 80. C; Tend: 240. C |
Capillary | DB-5 | 1500. | Everaerts, Roisin, et al., 1993 | Helium, 3. K/min; Column length: 60. m; Column diameter: 0.32 mm; Tstart: 60. C; Tend: 220. C |
Capillary | Methyl Silicone | 1477. | Gopalakrishnan, Menon, et al., 1993 | 50. m/0.25 mm/0.17 μm, N2, 2. K/min; Tstart: 80. C; Tend: 200. C |
Capillary | Methyl Silicone | 1480. | Gopalakrishnan, Menon, et al., 1993 | 50. m/0.25 mm/0.17 μm, N2, 3. K/min; Tstart: 80. C; Tend: 200. C |
Capillary | CP Sil 5 CB | 1482. | Kaul, Singh, et al., 1993 | 5. K/min; Column length: 25. m; Column diameter: 0.25 mm; Tstart: 60. C; Tend: 280. C |
Capillary | OV-101 | 1483. | Tkachenko and Zenkevich, 1993 | Helium, 40. C @ 0. min, 3. K/min, 200. C @ 0. min; Column length: 52. m; Column diameter: 0.26 mm |
Capillary | SE-54 | 1478. | Kollmannsberger, Nitz, et al., 1992 | 30. m/0.25 mm/0.25 μm, Hydrogen, 60. C @ 5. min, 2. K/min, 250. C @ 2. min |
Capillary | DB-1 | 1480. | Binder, Benson, et al., 1990 | 4. K/min, 230. C @ 10. min; Column length: 60. m; Column diameter: 0.32 mm; Tstart: 50. C |
Capillary | DB-1 | 1480. | Binder, Turner, et al., 1990 | 4. K/min, 230. C @ 10. min; Tstart: 50. C |
Capillary | DB-1 | 1480. | Binder, Turner, et al., 1990, 2 | 4. K/min, 230. C @ 10. min; Column length: 60. m; Column diameter: 0.32 mm; Tstart: 50. C |
Capillary | DB-1 | 1478. | Binder and Flath, 1989 | 50. C @ 0.1 min, 4. K/min, 250. C @ 5. min; Column length: 60. m; Column diameter: 0.32 mm |
Capillary | SE-30 | 1477. | Ramaswami, Briscese, et al., 1988 | 50. C @ 2. min, 4. K/min, 240. C @ 10. min; Column length: 30. m |
Capillary | OV-1 | 1470. | de Pooter, de Buyck, et al., 1986 | 40. m/0.5 mm/0.75 μm, He, 3. K/min; Tstart: 30. C; Tend: 220. C |
Capillary | SE-30 | 1477. | Ramaswami, Briscese, et al., 1986 | 50. C @ 2. min, 4. K/min, 240. C @ 10. min; Column length: 30. m |

Normal alkane RI, non-polar column, custom temperature program

Column type | Active phase | I | Reference | Comment |
---|---|---|---|---|
Capillary | DB-5 | 1489. | Rodriques, Amorim, et al., 2013 | 30. m/0.25 mm/0.25 μm, Helium; Program: not specified |
Capillary | RTX-1 | 1481. | Bendiabdellah, El Amine Dib, et al., 2012 | 60. m/0.22 mm/0.25 μm, Helium; Program: not specified |
Capillary | CBP-5 | 1490. | de Morais, Oliveira, et al., 2012 | 30. m/0.25 mm/0.25 μm, Helium; Program: 60 0C 3 0C/min -> 240 0C 10 0C/min -> 280 0C (10 min) |
Capillary | VF-5 | 1488. | Shivashankar, Roy, et al., 2012 | 30. m/0.25 mm/0.25 μm, Helium; Program: 50 0C (2 min) 3 0C/min -> 200 0C (3 min) 10 0C/min -> 220 0C (8 min) |
Capillary | VF-5 | 1483. | Shivashankar, Roy, et al., 2012 | 30. m/0.25 mm/0.25 μm, Helium; Program: not specified |
Capillary | 5 % Phenyl polydimethyl siloxane | 1485. | Chaverri, Diaz, et al., 2011 | Program: not specified |
Capillary | HP-5 MS | 1486. | Feizbakhsh and Naeemy, 2011 | 30. m/0.25 mm/0.25 μm, Helium; Program: not specified |
Capillary | HP-5 MS | 1488. | Feizbakhsh and Naeemy, 2011 | 30. m/0.25 mm/0.25 μm, Helium; Program: not specified |
Capillary | HP-5 | 1481. | Laribi, Kouki, et al., 2011 | 30. m/0.25 mm/0.25 μm, Nitrogen; Program: 35 0C (10 min) 3 0C/min -> 205 0C 10 0C/min -> 225 0C |
Capillary | HP-5 MS | 1488. | Nance and Setzer, 2011 | 30. m/0.25 mm/0.25 μm, Helium; Program: 40 0C (10 min) 3 0C/min -> 200 0C 2 0C/min -> 220 0C |
Capillary | RTX-1 | 1480. | Dib, Djabou, et al., 2010 | 60. m/0.22 mm/0.25 μm, Helium; Program: not specified |
Capillary | CP-Sil 8 CB | 1489. | Di Giusto, Bessiere, et al., 2010 | 30. m/0.25 mm/0.25 μm, Helium; Program: Multi-rise program |
Capillary | HP-5 MS | 1488. | Sharifiar, Yassa, et al., 2010 | 30. m/0.25 mm/0.25 μm, Helium; Program: 50 0C (3 min) 3 0C/min -> 160 0C (10 min) 3 0C/min -> 240 0C |
Capillary | DB-1 | 1487. | Xu, Tang, et al., 2010 | 30. m/0.25 mm/0.25 μm, Helium; Program: not specified |
Capillary | DB-5 | 1490. | Courtois, Paine, et al., 2009 | 30. m/0.25 mm/0.25 μm, Helium; Program: 50 0C m6 0C/min -> 140 0C 5 0C/min -> 160 0C (1 min) 10 0C/min -> 200 0C |
Capillary | HP-5 | 1478. | Custer, 2009 | 25. m/0.32 mm/0.17 μm, Helium; Program: 60 0C (5 min) 4 0C/min -> 220 0C 11 0C/min -> 280 0C (15 min) |
Capillary | HP-5 | 1479. | Custer, 2009 | 25. m/0.32 mm/0.17 μm, Helium; Program: 60 0C (5 min) 4 0C/min -> 220 0C 11 0C/min -> 280 0C (15 min) |
Capillary | HP-5 | 1488. | Custer, 2009 | 25. m/0.32 mm/0.17 μm, Helium; Program: 60 0C (5 min) 4 0C/min -> 220 0C 11 0C/min -> 280 0C (15 min) |
Capillary | HP-5 | 1490. | Custer, 2009 | 25. m/0.32 mm/0.17 μm, Helium; Program: not specified |
Capillary | HP-5 | 1490. | Custer, 2009 | 25. m/0.32 mm/0.17 μm, Helium; Program: not specified |
Capillary | HP-5 | 1490. | Custer, 2009 | 25. m/0.32 mm/0.17 μm, Helium; Program: not specified |
Capillary | Optima-5MS | 1483. | HEuskin, Godin, et al., 2009 | 30. m/0.32 mm/0.25 μm, Helium; Program: 40 0C (5 min) 5 0C/min -> 230 0C 30 0C/min -> 280 0C (5 min) |
Capillary | Elite-5 MS | 1485. | Kapoor, Singh, et al., 2009 | 30. m/0.25 mm/0.25 μm, Helium; Program: 60 0C (1 min) 1.5 0C/min -> 185 0C (1 min) 9 0C/min -> 275 0C (2 min) |
Capillary | Elite-5 MS | 1485. | Kapoor, Singh, et al., 2009 | 30. m/0.25 mm/0.25 μm, Helium; Program: 60 0C (1 min) 1.5 0C/min -> 185 0C (1 min) 9 0C/min -> 275 0C (2 min) |
Capillary | HP-5 MS | 1475. | Mancini, Arnold, et al., 2009 | 30. m/0.25 mm/0.25 μm, Helium; Program: 40 0C (5 min) 2 0C/min -> 270 0C -> 260 0C (20 min) |
Capillary | DB-5 | 1494. | Yang, Yang, et al., 2009 | 30. m/0.25 mm/0.25 μm, Helium; Program: 50 0C 95 min) 3 0C/min -> 100 0C 4 0C/min -> 160 0C 5 0C/min -> 220 0C (15 min) |
Capillary | OV-1 | 1454. | Yu, Li, et al., 2009 | Helium; Column length: 30. m; Column diameter: 0.25 mm; Program: 40 0C 2 0C/min -> 130 0C (5 min) 10 0C/min -> 230 0C (15 min) |
Capillary | DB-5 | 1490. | de Albuquerque, Alves, et al., 2008 | 30. m/0.25 mm/0.25 μm, Hydrogen; Program: 35 0C 4 0C/min -> 180 0C 17 0C/min -> 280 0C (10 min) |
Capillary | SLB-5 MS | 1492. | Costa, De Fina, et al., 2008 | 30. m/0.25 mm/0.25 μm, Helium; Program: 50 0C 3 0C/min -> 250 0C (1 min) 10 0C/min -> 300 0C (5 min) |
Capillary | SLB-5 MS | 1489. | Costa, De Fina, et al., 2008 | 30. m/0.25 mm/0.25 μm, Helium; Program: not specified |
Capillary | CP Sil 8 CB | 1490. | Kupcinskiene, Stikliene, et al., 2008 | 50. m/0.32 mm/0.25 μm, Helium; Program: not specified |
Capillary | DB-1 | 1476. | Nogueira, Marcelo-Curto, et al., 2008 | 30. m/0.25 mm/0.25 μm, He; Program: 45C => 3C/min => 175C => 15C/min => 300C (10min) |
Capillary | CP-Sil 8CB-MS | 1492. | Profitt, Schatz, et al., 2008 | 30. m/0.25 mm/0.25 μm, Helium; Program: 50 0C(3 min) 3 0C/min -> 100 0C 2.7 0C/min -> 140 0C 2.4 0C/min -> 180 0C 6 0C/min -> 260 0C |
Capillary | Elite-1 | 1490. | Raj, Baby, et al., 2008 | 30. m/0.32 mm/0.25 μm, Helium; Program: not specified |
Capillary | DB-5 MS | 1487. | Silva, Doria, et al., 2008 | 30. m/0.25 mm/0.25 μm; Program: 80 0C (1.5 min) 4 pC/min -> 180 0C 10 0C/min -> 300 0C (10 min) |
Capillary | HP-5MS | 1486. | Cole, Haber, et al., 2007 | 30. m/0.25 mm/0.25 μm, He; Program: 40C(10min) => 3C/min => 200C => 2C/min => 220C |
Capillary | HP-5 MS | 1486. | Eason and Setzer, 2007 | 30. m/0.25 mm/0.25 μm, Helium; Program: 40 0C (10 min) 3 0C/min -> 200 0C 2 0C/min -> 220 0C |
Capillary | DB-1 | 1476. | Ferreira, Meireles de Sousa, et al., 2007 | 30. m/0.25 mm/0.25 μm, He; Program: 45C => 3C/min => 175C => 15C/min => 300C (10min) |
Capillary | HP-5MS | 1490. | Liu, Song, et al., 2007 | 30. m/0.25 mm/0.25 μm, He; Program: 40C(3min) => 8C/min => 160C => 15C/min => 300C (10min) |
Capillary | CP Sil 8 CB | 1489. | Meekijjaroenroj, Bessière, et al., 2007 | 30. m/0.25 mm/0.25 μm, He; Program: 50C(3min) => 3C/min => 100C => 2.7C/min => 140C => 2.4C/min => 180C => 6C/min => 250C |
Capillary | HP-5 MS | 1487. | Moriarity, Bansal, et al., 2007 | 30. m/0.25 mm/0.25 μm, Helium; Program: 40 0C (10 min) 3 0C/min -> 200 0C 2 0C/min -> 220 0C |
Capillary | HP-5 MS | 1488. | Moriarity, Bansal, et al., 2007 | 30. m/0.25 mm/0.25 μm, Helium; Program: 40 0C (10 min) 3 0C/min -> 200 0C 2 0C/min -> 220 0C |
Capillary | CP-Sil | 1474. | Proffit, 2007 | 30. m/0.25 mm/0.25 μm, Helium; Program: 50 0C (3 min) 3 0C/min -> 100 0C 2.7 0C/min -> 140 0C 2.4 0C/min -> 180 0C 6 0C/min -> 250 0C |
Capillary | CP-Sil | 1492. | Proffit, 2007 | 30. m/0.25 mm/0.25 μm, Helium; Program: 50 0C (3 min) 3 0C/min -> 100 0C 2.7 0C/min -> 140 0C 2.4 0C/min -> 180 0C 6 0C/min -> 250 0C |
Capillary | CP-Sil | 1492. | Proffit, 2007 | 30. m/0.25 mm/0.25 μm, Helium; Program: 50 0C (3 min) 3 0C/min -> 100 0C 2.7 0C/min -> 140 0C 2.4 0C/min -> 180 0C 6 0C/min -> 250 0C |
Capillary | HP-5 MS | 1486. | Setzer, Stokes, et al., 2007 | Helium; Column length: 30. m; Column diameter: 0.25 mm; Program: 40 0C (10 min) 3 oC/min -> 200 0C 2 0C/min -> 220 0C |
Capillary | HP-5 MS | 1486. | Stokes, Cole, et al., 2007 | Program: not specified |
Capillary | HP-5MS | 1486. | Takaku, Haber, et al., 2007 | He; Column length: 30. m; Column diameter: 0.25 mm; Program: 40C(10min) => 3C/min => 200C => 2C/min => 220C |
Capillary | HP-5MS | 1494. | Deng, Xu, et al., 2006 | 30. m/0.25 mm/0.25 μm, He; Program: 50C(2min) => 6C/min => 200C => 10C/min => 270C(10min) |
Capillary | CP Sil 8 CB | 1490. | Judzentiene and Buzelyte, 2006 | 50. m/0.32 mm/0.25 μm, He; Program: 60C(2min) => 5C/min => 160C(1min) => 10C/min => 250C (5min) |
Capillary | HP-5 MS | 1491. | Kawaree, Phutdhawong, et al., 2006 | 30. m/0.25 mm/0.25 μm, HGelium; Program: 40 0C (3 min) 10 0C/min -> 108 0C 3 0C/min -> 188 0C 4 0C/min -> 280 0C (5 min) |
Capillary | HP-5MS | 1491. | Li, Deng, et al., 2006 | 30. m/0.25 mm/0.25 μm, He; Program: 40C(1min) => 8C/min => 160C => 12C/min => 300C(5min) |
Capillary | HP-5MS | 1498. | Li, Deng, et al., 2006 | 30. m/0.25 mm/0.25 μm, He; Program: 40C(1min) => 8C/min => 160C => 12C/min => 300C(5min) |
Capillary | HP-5 MS | 1486. | Schmidt, Noletto, et al., 2006 | 30. m/0.25 mm/0.25 μm, Helium; Program: 40 0C (10 min) 3 0C/min -> 200 0C 2 0C/min -> 220 0C |
Capillary | HP-5 MS | 1486. | Schmidt, Noletto, et al., 2006 | 30. m/0.25 mm/0.25 μm, Helium; Program: 40 0C (10 min) 3 0C/min -> 200 0C 2 0C/min -> 220 0C |
Capillary | HP-5MS | 1491. | Singh, Marimuthu, et al., 2006 | 30. m/0.25 mm/0.25 μm, He; Program: 60C => 1.5C/min => 185C(1min) => 9C/min => 275C(2min) |
Capillary | DB-5 | 1483. | Srivastava, Mallavarapu, et al., 2006 | 30. m/0.32 mm/0.25 μm, He; Program: 60C => 2C/min => 100C => 3C/min => 160C => 5C/min => 280C |
Capillary | SE-52 | 1490. | Tognolini, Barocelli, et al., 2006 | 30. m/0.32 mm/0.15 μm, He; Program: 45C => 1C/min => 100C => 5C/min => 250C (10min) |
Capillary | DB-5MS | 1482. | Tuberoso, Barra, et al., 2006 | 30. m/0.25 mm/0.25 μm, He; Program: 60C => 3C/min => 180C => 250C (2min) |
Capillary | VF-5MS | 1488. | Xie, Sun, et al., 2006 | 30. m/0.25 mm/0.25 μm, He; Program: 40C(1min) => 15C/min => 100C => 4C/min => 250C (1min) |
Capillary | CP Sil 8 CB | 1490. | Butkienë, Nivinskienë, et al., 2005 | 50. m/0.32 mm/0.25 μm, He; Program: 50C(5min) => 2C/min => 90C => 15C/min => 240C(4min) |
Capillary | DB-5 | 1488. | Cysne, Canuto, et al., 2005 | 30. m/0.25 mm/0.25 μm, He; Program: 35C => 4C/min => 180C => 10C/min => 250C |
Capillary | DB-1 | 1476. | Figueiredo, Sim-Sim, et al., 2005 | 30. m/0.25 mm/0.25 μm, He; Program: 45C => 3C/min => 175C => 15C/min => 300C (10min) |
Capillary | DB-5 | 1483. | Hamm, Bleton, et al., 2005 | 30. m/0.25 mm/0.25 μm, He; Program: 40C(1min) => 9C/min => 130C => 2C/min => 230C |
Capillary | Polydimethyl siloxane with 5 % Ph groups | 1486. | Pino, Marbot, et al., 2005 | Program: not specified |
Capillary | DB-5 | 1460. | Albuquerque, Silveira, et al., 2004 | 30. m/0.25 mm/0.1 μm, He; Program: 35C => 4C/min => 180C => 10C/min => 250C |
Capillary | CP Sil 8 CB | 1490. | Butkienë, Nivinskienë, et al., 2004 | 50. m/0.32 mm/0.25 μm, He; Program: 50C(5min) => 2C/min => 90C => 15C/min => 240C(4min) |
Capillary | DB-1 | 1491. | Cavalcanti, de Morais, et al., 2004 | He; Column length: 30. m; Column diameter: 0.25 mm; Program: 35C => 4C/min => 180C => 10C/min => 250C |
Capillary | Methyl Silicone | 1483. | Couladis, Özcan, et al., 2004 | Program: not specified |
Capillary | HP-5MS | 1491. | Deng, Li, et al., 2004 | 30. m/0.25 mm/0.25 μm, He; Program: 60C => 10C/min => 160C => 12C/min => 300C (5min) |
Capillary | OV-1 | 1472. | El-Shazly and Hussein, 2004 | He; Column length: 15. m; Column diameter: 0.317 mm; Program: 50C(4min) => 4C/min => 90C => 10C/min => 300C(10min) |
Capillary | DB-5 | 1483. | Hamm, Bleton, et al., 2004 | 30. m/0.25 mm/0.25 μm, He; Program: 40C(1min) => 9C/min => 130C => 2C/min => 230C |
Capillary | CP Sil 8 CB | 1485. | Judpentienë and Mockutë, 2004 | 50. m/0.32 mm/0.25 μm, He; Program: 60C(2min) => 5C/min => 160C(1min) => 10C/min => 250C (5min) |
Capillary | DB-5 | 1490. | Letchamo, Ward, et al., 2004 | 30. m/0.25 mm/0.25 μm, He; Program: 60C(4min) => 6C/min => 240 => 10C/min => 280C |
Capillary | HP-5 | 1475. | Senatore, Apostolides Arnold, et al., 2004 | 30. m/0.25 mm/0.25 μm; Program: 40C(5min) => 2C/min => 250C(15min) => 10C/min => 270C |
Capillary | DB-1 | 1482. | Silva, Matos, et al., 2004 | 30. m/0.25 mm/0.25 μm, Helium; Program: 35 0C 4 0C/min -> 180 0C 10 0C/min -> 250 0C |
Capillary | DB-1 | 1477. | Silva, Matos, et al., 2004 | 30. m/0.25 mm/0.25 μm, Helium; Program: 35 0C 4 0C/min -> 180 0C 10 0C/min -> 250 0C |
Capillary | HP-5MS | 1488. | Singh, Marimuthu, et al., 2004 | 30. m/0.25 mm/0.25 μm; Program: 60C(1min) => 1.5C/min => 185C(1min) => 9C/min => 275C(2min) |
Capillary | HP-5MS | 1492. | Singh, Maurya, et al., 2004 | 30. m/0.25 mm/0.25 μm, He; Program: 60C(1min) => 0.5C/min => 85C(1min) => 1C/min => 105C (2min) => 10C/min => 275C(2min) |
Capillary | HP-5 | 1490. | Tepe, Donmez, et al., 2004 | 30. m/0.25 mm/0.25 μm, He; Program: 50C (3min) => 3C/min => 150C (10min) => 10C/min => 250C |
Capillary | SE-30 | 1475. | Vinogradov, 2004 | Program: not specified |
Capillary | DB-5 | 1483. | Hamm, Lesellier, et al., 2003 | 30. m/0.25 mm/0.25 μm, He; Program: 40C (1min) => 9C/min => 130C => 2C/min => 230C |
Capillary | CP Sil 8 CB | 1485. | Mockute, Nivinskiene, et al., 2003 | 50. m/0.32 mm/0.25 μm, He; Program: 60C(1min) => 5C/min => 160C => 10C/min => 250C(5min) |
Capillary | SE-54 | 1458. | Kilic, 2002 | Program: not specified |
Capillary | DB-5 | 1491. | Pessoa, Morais, et al., 2002 | 30. m/0.25 mm/0.1 μm, He; Program: 35C => 4C/min => 180C => 10C/min => 250C |
Capillary | CP Sil 8 CB | 1490. | Schwob, Bessière, et al., 2002, 2 | Program: not specified |
Capillary | DB-5 | 1485. | Isidorov, Zenkevich, et al., 2001 | He; Column length: 30. m; Column diameter: 0.25 mm; Program: not specified |
Capillary | CP Sil 5 CB | 1500. | Lermusieau, Bulens, et al., 2001 | 50. m/0.32 mm/1.2 μm; Program: 36C => 20C/min => 120C(20min) => 2C/min => 250C(30min) |
Capillary | DB-5 | 1485. | Andrade, Maia, et al., 2000 | 30. m/0.25 mm/0.25 μm, He; Program: 40C => 2C/min => 60C => 4C/min => 260C |
Capillary | HP-5MS | 1494. | Bouwmeester, Wallaart, et al., 1999 | 30. m/0.25 mm/0.25 μm, He; Program: not specified |
Capillary | DB-1 | 1476. | Baratta, Dorman, et al., 1998 | 30. m/0.25 mm/0.25 μm, He; Program: 45C => 3C/min => 175C => 15C/min => 240C (10min) |
Capillary | DB-5 | 1493. | Sanda, Koba, et al., 1998 | 30. m/0.25 mm/0.25 μm, N2; Program: 45C(5min) => 2C/min => 200C => 5C/min => 250C |
Capillary | DB-1 | 1476. | da Silva, Figueiredo, et al., 1998 | 30. m/0.25 mm/0.25 μm, H2; Program: 45C => 3C/min => 175C => 15C => 240C(10min) |
Capillary | CP Sil 5 CB | 1485. | Weyerstahl, Marschall, et al., 1998 | N2; Column length: 25. m; Program: not specified |
Capillary | DB-5 | 1485. | Yusuf, Begum, et al., 1998 | 30. m/0.25 mm/0.25 μm, He; Program: 60C => 3C/min => 240C => 30C/min => 300C |
Capillary | CP Sil 5 CB | 1484. | Weyerstahl, Marschall, et al., 1997 | N2; Column length: 30. m; Column diameter: 0.25 mm; Program: not specified |
Capillary | Methyl Silicone | 1475. | Zenkevich, 1996 | Program: not specified |
Capillary | DB-1 | 1480. | Binder and Flath, 1989 | Column length: 60. m; Column diameter: 0.32 mm; Program: not specified |

Normal alkane RI, polar column, temperature ramp

Column type | Active phase | I | Reference | Comment |
---|---|---|---|---|
Capillary | HP-Innowax | 1724. | Feng, Cui, et al., 2011 | 60. m/0.25 mm/0.25 μm, Helium, 60. C @ 1. min, 5. K/min, 220. C @ 5. min |
Capillary | DB-FFAP | 1729. | Osorio, Carriazo, et al., 2011 | 30. m/0.32 mm/0.25 μm, Helium, 50. C @ 4. min, 4. K/min, 250. C @ 5. min |
Capillary | CP-Wax 52 CB | 1753. | Tsai, Huang, et al., 2011 | 60. m/0.25 mm/0.25 μm, Helium, 3. K/min; Tstart: 40. C; Tend: 220. C |
Capillary | RTX-Wax | 1685. | Dib, Djabou, et al., 2010 | 60. m/0.22 mm/0.25 μm, Helium, 2. K/min, 230. C @ 30. min; Tstart: 60. C |
Capillary | Supelcowax | 1732. | Gauvin-Bialecki and Marodon, 2009 | 60. m/0.35 mm/0.25 μm, Nitrogen, 4. K/min, 230. C @ 40. min; Tstart: 60. C |
Capillary | RTX-Wax | 1695. | Museli, Pau, et al., 2009 | 60. m/0.22 mm/0.25 μm, Helium, 2. K/min, 230. C @ 30. min; Tstart: 60. C |
Capillary | DB-Wax | 1727. | Shimizu, Imayoshi, et al., 2009 | 60. m/0.25 mm/0.25 μm, Helium, 50. C @ 2. min, 3. K/min, 220. C @ 70. min |
Capillary | HP Innowax | 1717. | Capetanos, Saroglou, et al., 2007 | 30. m/0.32 mm/0.50 μm, Helium, 3. K/min; Tstart: 60. C; Tend: 260. C |
Capillary | HP-Innowax | 1708. | Hachicha, Skanji, et al., 2007 | 30. m/0.25 mm/0.25 μm, He, 2. K/min, 240. C @ 20. min; Tstart: 60. C |
Capillary | CP-Wax 52CB | 1704. | Hymete, Rohloff, et al., 2007 | 30. m/0.32 mm/0.25 μm, He, 40. C @ 1. min, 3. K/min, 220. C @ 2. min |
Capillary | HP-20M | 1670. | Jerkovic, Mastelic, et al., 2007 | 50. m/0.2 mm/0.2 μm, He, 70. C @ 4. min, 4. K/min; Tend: 180. C |
Capillary | TC-FFAP | 1717. | Kurose, Okamura, et al., 2007 | He, 3. K/min, 220. C @ 30. min; Column diameter: 0.25 mm; Phase thickness: 0.25 μm; Tstart: 60. C |
Capillary | DB-Wax | 1704. | Pala-Paul, Brophy, et al., 2007 | 60. m/0.32 mm/0.25 μm, He, 4. K/min; Tstart: 70. C; Tend: 220. C |
Capillary | Supelcowax-10 | 1711. | Pinto, Salgueiro, et al., 2007 | 30. m/0.2 mm/0.2 μm, He, 3. K/min, 220. C @ 15. min; Tstart: 70. C |
Capillary | DB-Wax | 1734. | Wei A. and Shibamoto T., 2007 | 60. m/0.25 mm/0.25 μm, He, 60. C @ 8. min, 3. K/min, 180. C @ 80. min |
Capillary | Innowax | 1735. | Abdelwahed, Hayder, et al., 2006 | 30. m/0.25 mm/0.25 μm, N2, 50. C @ 3. min, 9. K/min, 280. C @ 3. min |
Capillary | Innowax | 1742. | Abdelwahed, Hayder, et al., 2006 | 30. m/0.25 mm/0.25 μm, N2, 50. C @ 3. min, 9. K/min, 280. C @ 3. min |
Capillary | AT-Wax | 1730. | Borges, Rojas, et al., 2006 | 60. m/0.25 mm/0.25 μm, He, 4. K/min, 200. C @ 20. min; Tstart: 60. C |
Capillary | BP-20 | 1706. | Boti, Muselli, et al., 2006 | 50. m/0.22 mm/0.25 μm, He, 2. K/min, 220. C @ 20. min; Tstart: 60. C |
Capillary | BP-20 | 1714. | Boti, Yao, et al., 2006 | 50. m/0.22 mm/0.25 μm, 2. K/min, 220. C @ 20. min; Tstart: 60. C |
Capillary | CP-Wax 52CB | 1715. | Hymete, Rohloff, et al., 2006 | 30. m/0.32 mm/0.25 μm, He, 60. C @ 7. min, 3.3 K/min, 220. C @ 3. min |
Capillary | BP-20 | 1715. | Lesueur, Ban, et al., 2006 | 50. m/0.22 mm/0.25 μm, He, 2. K/min, 220. C @ 20. min; Tstart: 60. C |
Capillary | Supelcowax | 1725. | Martin, Joseph, et al., 2006 | 30. m/0.32 mm/0.25 μm, N2, 5. K/min; Tstart: 50. C; Tend: 200. C |
Capillary | Supelcowax-10 | 1710. | Wong, Lim, et al., 2006 | 30. m/0.25 mm/0.25 μm, He, 50. C @ 1. min, 4. K/min, 220. C @ 10. min |
Capillary | Supelcowax-10 | 1700. | Wong, Sivasothy, et al., 2006 | 30. m/0.25 mm/0.25 μm, He, 50. C @ 1. min, 4. K/min, 250. C @ 10. min |
Capillary | Supelcowax | 1706. | Gauvin and Smadja, 2005 | 60. m/0.2 mm/0.2 μm, He, 60. C @ 30. min, 4. K/min; Tend: 230. C |
Capillary | CP-Wax | 1693. | Ka, Choi, et al., 2005 | 30. m/0.32 mm/0.25 μm, He, 40. C @ 2. min, 5. K/min; Tend: 180. C |
Capillary | DB-Wax | 1704. | Palá-Paúl, Pérez-Alonso, et al., 2005 | 60. m/0.32 mm/0.25 μm, He, 3. K/min; Tstart: 35. C; Tend: 220. C |
Capillary | BP-20 | 1715. | Blanc, Muselli, et al., 2004 | 50. m/0.22 mm/0.25 μm, 2. K/min, 220. C @ 20. min; Tstart: 60. C |
Capillary | DB-Wax | 1714. | Jiang and Kubota, 2004 | He, 60. C @ 4. min, 2. K/min; Column length: 60. m; Column diameter: 0.25 mm; Tend: 220. C |
Capillary | DB-Wax | 1714. | Jiang and Kubota, 2004 | He, 60. C @ 4. min, 2. K/min; Column length: 60. m; Column diameter: 0.25 mm; Tend: 220. C |
Capillary | Carbowax 20M | 1678. | Lago, de Ávila, et al., 2004 | 30. m/0.25 mm/0.25 μm, He, 3. K/min; Tstart: 60. C; Tend: 250. C |
Capillary | Supelcowax-10 | 1710. | Orav, Stulova, et al., 2004 | 50. m/0.2 mm/0.25 μm, He, 2. K/min; Tstart: 70. C; Tend: 230. C |
Capillary | Supelcowax-10 | 1709. | Orav, Stulova, et al., 2004 | 50. m/0.2 mm/0.25 μm, He, 2. K/min; Tstart: 70. C; Tend: 230. C |
Capillary | Supelcowax-10 | 1733. | Cabanillas, Lopez, et al., 2003 | 30. m/0.25 mm/0.25 μm, He, 4. K/min; Tstart: 60. C; Tend: 240. C |
Capillary | HP-20M | 1685. | Juteau, Jerkovic, et al., 2003 | 50. m/0.2 mm/0.2 μm, He, 70. C @ 4. min, 4. K/min, 180. C @ 10. min |
Capillary | CP-Wax 52CB | 1753. | Mau, Lai, et al., 2003 | 60. m/0.25 mm/0.25 μm, He, 3. K/min; Tstart: 40. C; Tend: 220. C |
Capillary | Innowax | 1742. | Suleimenov, Atazharova, et al., 2003 | He, 60. C @ 10. min, 4. K/min, 220. C @ 10. min; Column length: 60. m; Column diameter: 0.25 mm |
Capillary | RTX-Wax | 1670. | Galindo-Cuspinera, Lubran, et al., 2002 | 60. m/0.25 mm/0.5 μm, He, 40. C @ 5. min, 5. K/min, 180. C @ 20. min |
Capillary | RTX-Wax | 1739. | Galindo-Cuspinera, Lubran, et al., 2002 | 60. m/0.25 mm/0.5 μm, He, 40. C @ 5. min, 5. K/min, 180. C @ 20. min |
Capillary | Supelcowax-10 | 1691. | Kabouss, Charrouf, et al., 2002 | 30. m/0.25 mm/0.25 μm, 40. C @ 2. min, 2. K/min, 210. C @ 33. min |
Capillary | HP-Wax | 1732. | Priestap, van Baren, et al., 2002 | 50. m/0.25 mm/0.25 μm, N2, 75. C @ 4. min, 3. K/min; Tend: 220. C |
Capillary | DB-Wax | 1724. | Christoph, 2001 | 60. m/0.25 mm/0.25 μm, He, 3. K/min; Tstart: 45. C; Tend: 240. C |
Capillary | Stabilwax | 1696. | Jirovetz L., Buchbauer G., et al., 2001 | 30. m/0.32 mm/0.25 μm, H2, 60. C @ 5. min, 10. K/min, 280. C @ 5. min |
Capillary | TC-Wax | 1715. | Miyazawa, Kurose, et al., 2001 | He, 4. K/min, 250. C @ 47. min; Column length: 60. m; Column diameter: 0.25 mm; Tstart: 80. C |
Capillary | DB-Wax | 1679. | Franco and Shibamoto, 2000 | He, 50. C @ 8. min, 3. K/min; Column length: 30. m; Column diameter: 0.2 mm; Tend: 180. C |
Capillary | DB-Wax | 1727. | Tamura, Boonbumrung, et al., 2000 | Nitrogen, 40. C @ 10. min, 2. K/min; Column length: 60. m; Column diameter: 0.25 mm; Tend: 200. C |
Capillary | BP-20 | 1731. | Dunlop, Bignell, et al., 1999 | 25. m/0.33 mm/0.5 μm, 5. K/min; Tstart: 80. C; Tend: 220. C |
Capillary | DB-Wax | 1735. | Ngassoum, Yonkeu, et al., 1999 | 60. m/0.25 mm/0.25 μm, He, 4. K/min; Tstart: 60. C; Tend: 240. C |
Capillary | DB-Wax | 1729. | Weyerstahl, Marschall, et al., 1999, 2 | N2, 5. K/min; Column length: 60. m; Phase thickness: 0.25 μm; Tstart: 60. C; Tend: 220. C |
Capillary | BP-20 | 1731. | Bignell, Dunlop, et al., 1998 | 25. m/0.33 mm/0.5 μm, H2, 5. K/min; Tstart: 80. C; Tend: 220. C |
Capillary | HP-Innowax FSC | 1690. | Tümen, Baser, et al., 1998 | 60. m/0.25 mm/0.25 μm, He, 60. C @ 10. min, 4. K/min, 220. C @ 10. min |
Capillary | BP-20 | 1731. | Bignell, Dunlop, et al., 1997 | 25. m/0.33 mm/0.5 μm, H2, 5. K/min; Tstart: 80. C; Tend: 220. C |
Capillary | BP-20 | 1731. | Bignell, Dunlop, et al., 1997, 2 | 25. m/0.33 mm/0.5 μm, H2, 5. K/min; Tstart: 80. C; Tend: 220. C |
Capillary | BP-20 | 1731. | Bignell, Dunlop, et al., 1997, 3 | 25. m/0.33 mm/0.5 μm, H2, 5. K/min; Tstart: 80. C; Tend: 220. C |
Capillary | BP-20 | 1731. | Bignell, Dunlop, et al., 1997, 4 | 25. m/0.33 mm/0.5 μm, H2, 5. K/min; Tstart: 80. C; Tend: 220. C |
Capillary | BP-20 | 1731. | Bignell, Dunlop, et al., 1997, 5 | 25. m/0.33 mm/0.5 μm, 5. K/min; Tstart: 80. C; Tend: 220. C |
Capillary | BP-20 | 1731. | Bignell, Dunlop, et al., 1997, 6 | 25. m/0.33 mm/0.5 μm, H2, 5. K/min; Tstart: 80. C; Tend: 220. C |
Capillary | Supelcowax-10 | 1743. | Zygadlo, Ariza-Espinar, et al., 1997 | He, 3. K/min; Column length: 0. m; Column diameter: 0.25 mm; Tstart: 40. C; Tend: 240. C |
Capillary | SP-1000 | 1720. | Brophy, Goldsack, et al., 1996 | He, 3. K/min; Column length: 85. m; Column diameter: 0.50 mm; Tstart: 65. C; Tend: 225. C |
Capillary | TC-Wax | 1725. | Shuichi, Masazumi, et al., 1996 | 80. C @ 5. min, 3. K/min; Column length: 60. m; Column diameter: 0.25 mm; Tend: 240. C |
Capillary | DB-Wax | 1733. | Stashenko, Puertas, et al., 1996 | 60. m/0.25 mm/0.25 μm, He, 50. C @ 5. min, 2.5 K/min; Tend: 180. C |
Capillary | Supelcowax-10 | 1743. | Wong and Lai, 1996 | 60. m/0.25 mm/0.25 μm, He, 40. C @ 3. min, 3. K/min, 200. C @ 30. min |
Capillary | DB-Wax | 1711. | Binder and French, 1994 | 4. K/min, 230. C @ 10. min; Column length: 60. m; Column diameter: 0.32 mm; Tstart: 50. C |
Capillary | DB-Wax | 1703. | Everaerts, Roisin, et al., 1993 | Helium, 3. K/min; Column length: 60. m; Column diameter: 0.32 mm; Tstart: 60. C; Tend: 220. C |
Capillary | Carbowax 20M | 1693. | Kollmannsberger, Nitz, et al., 1992 | 45. m/0.32 mm/1.0 μm, Hydrogen, 60. C @ 5. min, 2. K/min; Tend: 200. C |
Capillary | DB-Wax | 1715. | Binder, Benson, et al., 1990 | 4. K/min, 230. C @ 10. min; Column length: 60. m; Column diameter: 0.32 mm; Tstart: 50. C |
Capillary | DB-Wax | 1715. | Binder, Turner, et al., 1990 | 4. K/min, 230. C @ 10. min; Column length: 60. m; Column diameter: 0.32 mm; Tstart: 50. C |
Capillary | DB-Wax | 1717. | Binder, Turner, et al., 1990, 2 | 4. K/min, 230. C @ 10. min; Column length: 60. m; Column diameter: 0.32 mm; Tstart: 50. C |
Capillary | DB-Wax | 1714. | Binder and Flath, 1989 | 50. C @ 0.1 min, 4. K/min, 250. C @ 5. min; Column length: 60. m; Column diameter: 0.32 mm |
Capillary | Carbowax 20M | 1701. | Gaydou, Faure, et al., 1989 | 50. m/0.32 mm/0.15 μm, H2, 2. K/min; Tstart: 70. C; Tend: 210. C |
Capillary | DB-Wax | 1688. | Takeoka and Butter, 1989 | 60. m/0.32 mm/0.25 μm, He, 30. C @ 4. min, 2. K/min; Tend: 180. C |
Capillary | DB-Wax | 1689. | Takeoka and Butter, 1989 | 60. m/0.32 mm/0.25 μm, He, 30. C @ 4. min, 2. K/min; Tend: 180. C |
Capillary | Supelcowax-10 | 1727. | Ramaswami, Briscese, et al., 1988 | 50. C @ 2. min, 4. K/min, 240. C @ 10. min; Column length: 30. m |
Capillary | Supelcowax-10 | 1727. | Ramaswami, Briscese, et al., 1986 | He, 50. C @ 2. min, 4. K/min, 240. C @ 10. min; Column length: 30. m |

Normal alkane RI, polar column, custom temperature program

Column type | Active phase | I | Reference | Comment |
---|---|---|---|---|
Capillary | HP-Innowax | 1718. | Feng, Cui, et al., 2011 | 60. m/0.25 mm/0.25 μm, Helium; Program: not specified |
Capillary | HP Innowax | 1742. | Laribi, Kouki, et al., 2011 | 30. m/0.25 mm/0.25 μm, Nitrogen; Program: 35 0C (10 min) 3 0C/min -> 205 0C 10 0C/min -> 225 0C |
Capillary | Innowax | 1715. | Noorizadeh, Farmany, et al., 2011 | 60. m/0.25 mm/0.33 μm; Program: not specified |
Capillary | HP Innowax | 1715. | Noorizadeh and Farmany, 2010 | 60. m/0.25 mm/0.33 μm; Program: not specified |
Capillary | Innowax FSC | 1742. | Baser, Demirci, et al., 2009 | 60. m/0.25 mm/0.25 μm, Helium; Program: 60 0C (10 min) 4 0C/min -> 220 0C (10 min) 1 0C/min -> 240 0C |
Capillary | Polyethylene glycol (Free Fatty Acid Phase) | 1714. | Harraca, Syed, et al., 2009 | Column length: 30. m; Column diameter: 0.25 mm; Program: not specified |
Capillary | HP Innowax | 1715. | Mancini, Arnold, et al., 2009 | 50. m/0.20 mm/0.25 μm, Helium; Program: 40 0C (5 min) 2 0C/min -> 270 0C -> 260 0C (20 min) |
Capillary | Innowax | 1744. | Aicha, Ines, et al., 2008 | 30. m/0.25 mm/0.25 μm, Helium; Program: not specified |
Capillary | HP-Innowax | 1725. | Quijano and Pino, 2006 | 60. m/0.25 mm/0.25 μm, Nitrogen; Program: 50 0C (4 min) -> 40 0C 4 0C/min -> 220 0C |
Capillary | HP Innowax FSP | 1742. | Altintas, Kose, et al., 2004 | 60. m/0.25 mm/0.25 μm, N2; Program: 60C(10min) => 4C/min => 220C(10min) => 1C/min => 240C |
Capillary | Innowax FSC | 1742. | Baser, Özek, et al., 2004 | 60. m/0.25 mm/0.25 μm, He; Program: 60C(10min) => 4C/min => 220C(10min) => 1C/min => 240C |
Capillary | HP-Innowax FSC | 1742. | Klika, Demirci, et al., 2004 | 60. m/0.25 mm/0.25 μm, N2; Program: 60C(10min) => 4C/min => 220C(10min) => 1C/min => 240C |
Capillary | HP-Innowax | 1715. | Senatore, Apostolides Arnold, et al., 2004 | 50. m/0.2 mm/0.2 μm; Program: not specified |
Capillary | Carbowax 20M | 1746. | Vinogradov, 2004 | Program: not specified |
Capillary | Innowax FSC | 1742. | Baser, Demirci, et al., 2003 | 60. m/0.25 mm/0.25 μm, He; Program: 60C(10min) => 4C/min => 220C (10min) => 1C/min => 240C |
Capillary | Innowax FSC | 1742. | Demirci and Baser, 2003 | 60. m/0.25 mm/0.25 μm, He; Program: 60C (10min) => 4C/min => 220C (10min) => 1C/min => 240C |
Capillary | HP-Innowax FSC | 1742. | Kaya, Demirci, et al., 2003 | 60. m/0.25 mm/0.25 μm, N2; Program: 60C(10min) => 4C/min => 220C(10min) => 1C/min => 240C |
Capillary | Innowax FSC | 1742. | Baser, Demirei, et al., 2002 | 60. m/0.25 mm/0.25 μm, He; Program: 60C(10min) => 4C/min => 220C(10min) => 1C/min => 240C |
Capillary | HP-Innowax | 1742. | Baser, Demirci, et al., 2001 | 60. m/0.25 mm/0.25 μm, He; Program: 60 0C (10 min) 10 K/min -> 220 0C (10 min) 1K/min -> 240 0C |
Capillary | HP-Innowax | 1742. | Gören, Demirci, et al., 2001 | 60. m/0.25 mm/0.25 μm, He; Program: 60 0C (10 min) 4 K/min -> 220 0C (10 min) 1 K/min -> 240 0C |
Capillary | HP-Innowax | 1702. | Bouwmeester, Wallaart, et al., 1999 | 30. m/0.25 mm/0.25 μm, He; Program: not specified |
Capillary | FFAP | 1710. | Reddy, Angers, et al., 1998 | 25. m/0.2 mm/0.33 μm, H2; Program: 40C(5min) => 4C/min => 170C => 8C/min => 240C (12min) |
Capillary | NB-351 | 1666. | Kerrola and Kallio, 1994 | 25. m/0.32 mm/0.2 μm, He; Program: 35C(5min) => 2.5C/min => 150C => 5C/min => 240C (20min) |
Capillary | CP-Wax 52CB | 1712. | Vernin, 1991 | Column length: 50. m; Column diameter: 0.32 mm; Program: not specified |
Capillary | DB-Wax | 1717. | Binder and Flath, 1989 | Column length: 60. m; Column diameter: 0.32 mm; Program: not specified |

References

Clarke, Perry, et al., 1994
Clarke, D.B.; Perry, N.B.; Weavers, R.T.,
Foliage Oil Terpenes of Prumnopitys ferruginea (D. Don) Laubenf. Variation in Acorenone Levels,
J. Essnt. Oil Res., 1994, 6, 6, 549-554, https://doi.org/10.1080/10412905.1994.9699344
. [all data]
Andersen, Bissonette, et al., 1977
Andersen, N.H.; Bissonette, P.; Liu, C.-B.; Shunk, B.; Ohta, Y.; Tseng, C.-L.W.; Moore, A.; Huneck, S.,
Sesquiterpenes of nine European liverworts from the genera, Anastrepta, Bazzania, Jungermannia, Lepidozia, and Scapania,
Phytochemistry, 1977, 16, 11, 1731-1751, https://doi.org/10.1016/0031-9422(71)85081-1
. [all data]
Ohta, Andersen, et al., 1977
Ohta, Y.; Andersen, N.H.; Liu, C.-B.,
Sesquiterpene constituents of two liverworts of genus diplophyllum. Novel eudesmanolides and cytotoxicity studies for enantiomeric methylene lactones,
Tetrahedron, 1977, 33, 6, 617-628, https://doi.org/10.1016/0040-4020(77)80301-3
. [all data]
Jalali-Heravi, Zekavat, et al., 2006
Jalali-Heravi, M.; Zekavat, B.; Sereshti, H.,
Characterization of essential oil components of Iranian geranium oil using gas chromatography-mass spectrometry combined with chemometric resolution techniques,
J. Chromatogr. A, 2006, 1114, 1, 154-163, https://doi.org/10.1016/j.chroma.2006.02.034
. [all data]
Mevy, Bessiere, et al., 2006
Mevy, J.P.; Bessiere, J.M.; Rabier, J.; Dherbomez, M.; Ruzzier, M.; Millogo, J.; Viano, J.,
Composition and antimicrobial activities of the essential oil of Triumfetta rhomboidea Jacq.,
Flavour Fragr. J., 2006, 21, 1, 80-83, https://doi.org/10.1002/ffj.1511
. [all data]
Srivastava, Srivastava, et al., 2006
Srivastava, A.K.; Srivastava, S.K.; Syamsundar, K.V.,
Volatile composition of Curcuma angustifolia Roxb. rhizome from central and southern India,
Flavour Fragr. J., 2006, 21, 3, 423-426, https://doi.org/10.1002/ffj.1680
. [all data]
Tayoub, Schwob, et al., 2006
Tayoub, G.; Schwob, I.; Bessiere, J.-M.; Masotti, V.; Rabier, J.; Ruzzier, M.; Viano, J.,
Composition of volatile oils of Styrax (Styrax officinalis L.) leaves at different phenological stages,
Biochem. Syst. Ecol., 2006, 34, 9, 705-709, https://doi.org/10.1016/j.bse.2006.05.008
. [all data]
Tayoub, Schwob, et al., 2006, 2
Tayoub, G.; Schwob, I.; Bessière, J.-M.; Rabier, J.; Masotti, V.; J.; M.; Girard, G.; Viano, J.,
Essential oil composition of leaf, flower and stem of Styrax (Styrax officinalis L.) from south-eastern France,
Flavour Fragr. J., 2006, 21, 5, 809-812, https://doi.org/10.1002/ffj.1731
. [all data]
Asuming, Beauchamp, et al., 2005
Asuming, W.A.; Beauchamp, P.S.; Descalzo, J.T.; Dev, B.C.; Dev, V.; Frost, S.; Ma, C.W.,
Essential oil composition of four Lomatium Raf. species and their chemotaxonomy,
Biochem. Syst. Ecol., 2005, 33, 1, 17-26, https://doi.org/10.1016/j.bse.2004.06.005
. [all data]
Juliani, Zygadlo, et al., 2004
Juliani, H.R.; Zygadlo, J.A.; Scrivanti, R.; de la Sota, E.; Simon, J.E.,
The essential oil of Anemia tomentosa (Savigny) Sw. var. anthriscifolia (Schrad.) Mickel,
Flavour Fragr. J., 2004, 19, 6, 541-543, https://doi.org/10.1002/ffj.1341
. [all data]
Ogunwande, Olawore, et al., 2004
Ogunwande, I.A.; Olawore, N.O.; Adeleke, K.A.; Ekundayo, O.; König, W.A.,
Rare terpenoid esters from Hyparrhenia rufa (Nees) Stapf. growing wild in Nigeria,
Flavour Fragr. J., 2004, 19, 3, 239-243, https://doi.org/10.1002/ffj.1295
. [all data]
Santos, Lopes, et al., 2004
Santos, A.P.; Lopes, M.C.; Limberger, R.P.; Apel, M.A.; Henriques, A.T.; Moreno, P.R.H.,
Analysis of the volatile oil from Pilocarpus pennatifolius Lemmaire (Rutaceae) leaves by GC-MS,
Flavour Fragr. J., 2004, 19, 4, 325-326, https://doi.org/10.1002/ffj.1306
. [all data]
Amparo Blázquez, Pérez, et al., 2003
Amparo Blázquez, M.; Pérez, I.; Boira, H.,
Essential oil analysis of Teucrium libanitis and T. turredanum by GC and GC-MS,
Flavour Fragr. J., 2003, 18, 6, 497-501, https://doi.org/10.1002/ffj.1256
. [all data]
Couladis, Chinou, et al., 2003
Couladis, M.; Chinou, I.B.; Tzakou, O.; Petrakis, P.V.,
Composition and antimicrobial activity of the essential oil of Hypericum rumeliacum subsp. apollinis (Boiss. Heldr.),
Phytother. Res., 2003, 17, 2, 152-154, https://doi.org/10.1002/ptr.1093
. [all data]
Lucero, Estell, et al., 2003
Lucero, M.E.; Estell, R.E.; Frederickson, E.L.,
The essential oil composition of Psorothamnus scoparius (A. Gray) Rydb.,
J. Essent. Oil Res., 2003, 15, 2, 108-111, https://doi.org/10.1080/10412905.2003.9712083
. [all data]
Marongiu, Piras, et al., 2003
Marongiu, B.; Piras, A.; Pani, F.; Porcedda, S.; Ballero, M.,
Extraction, separation and isolation of essential oils from natural matrices by supercritical CO2,
Flavour Fragr. J., 2003, 18, 6, 505-509, https://doi.org/10.1002/ffj.1258
. [all data]
Ogunwande, Olawore, et al., 2003
Ogunwande, I.A.; Olawore, N.O.; Adeleke, K.A.; Ekundayo, O.; Koenig, W.A.,
Chemical composition of the leaf volatile oil of Psidium guajava L. growing in Nigeria,
Flavour Fragr. J., 2003, 18, 2, 136-138, https://doi.org/10.1002/ffj.1175
. [all data]
Özcan, Tzakou, et al., 2003
Özcan, M.; Tzakou, O.; Couladis, M.,
Essential oil composition of Turkish herbal tea (Salvia aucheri Bentham var. canescens Boiss. Heldr.),
Flavour Fragr. J., 2003, 18, 4, 325-327, https://doi.org/10.1002/ffj.1229
. [all data]
Viña and Murillo, 2003
Viña, A.; Murillo, E.,
Essential oil composition from twelve varieties of basil (Ocimum spp) grown in Columbia,
J. Braz. Chem. Soc., 2003, 14, 5, 744-749, https://doi.org/10.1590/S0103-50532003000500008
. [all data]
Juliani and Simon, 2002
Juliani, H.R.; Simon, J.E.,
Antioxidant acitivity of basil
in Trends in new crops and new uses, Janick,J.; Whipkey,A., ed(s)., ASHA Press, Alexandria, Va, 2002, 575-579. [all data]
Nagarajan, Rao, et al., 2001
Nagarajan, S.; Rao, L.J.M.; Gurudutt, K.N.,
Chemical composition of the volatiles of Hemidesmus indicus R. Br.,
Flavour Fragr. J., 2001, 16, 3, 212-214, https://doi.org/10.1002/ffj.985
. [all data]
Rajeswara Rao, 2001
Rajeswara Rao, B.R.,
Biomass and essential oil yields of rainfed palmarosa (Cymbopogon martinii (Roxb.) Wats. var. motia Burk.) supplied with different levels of organic manure and fertilizer nitrogen in semi-arid tropical climate,
Ind. Crops Prod., 2001, 14, 3, 171-178, https://doi.org/10.1016/S0926-6690(01)00081-4
. [all data]
Senatore and Rigano, 2001
Senatore, F.; Rigano, D.,
Essential oil of two Lippia spp. (Verbenaceae) growing wild in Guatemala,
Flavour Fragr. J., 2001, 16, 3, 169-171, https://doi.org/10.1002/ffj.972
. [all data]
Tzakou and Couladis, 2001
Tzakou, O.; Couladis, M.,
The essential oil of Micromeria graeca (L.) Bentham et Reichenb. growing in Greece,
Flavour Fragr. J., 2001, 16, 2, 107-109, https://doi.org/10.1002/ffj.955
. [all data]
Adams, 2000
Adams, R.P.,
The serrate leaf margined Juniperus (Section Sabina) of the western hemisphere: systematics and evolution based on leaf essential oils and Random Amplified Polymorphic DNAs (RAPDs),
Biochem. Syst. Ecol., 2000, 28, 10, 975-989, https://doi.org/10.1016/S0305-1978(00)00022-3
. [all data]
Roussis, Tsoukatou, et al., 2000
Roussis, V.; Tsoukatou, M.; Petrakis, P.V.; Chinou, I.; Skoula, M.; Harborne, J.B.,
Volatile constituents of four Helichrysum species growing in Greece,
Biochem. Syst. Ecol., 2000, 28, 2, 163-175, https://doi.org/10.1016/S0305-1978(99)00046-0
. [all data]
Dickens, 1999
Dickens, J.C.,
Predator-prey interactions: olfactory adaptations of generalist and specialist predators,
Agric. For. Entomol., 1999, 1, 1, 47-54, https://doi.org/10.1046/j.1461-9563.1999.00007.x
. [all data]
Kaul, Gujral, et al., 1999
Kaul, V.K.; Gujral, R.K.; Singh, B.,
Volatile constituents of the essential oil of flowers of Rosa brunonii Lindl,
Flavour Fragr. J., 1999, 14, 1, 9-11, https://doi.org/10.1002/(SICI)1099-1026(199901/02)14:1<9::AID-FFJ761>3.0.CO;2-C
. [all data]
Lopes, Kato, et al., 1999
Lopes, N.P.; Kato, M.J.; Andrade, E.H.A.; Maia, J.G.S.; Yoshida, M.; Planchart, A.R.; Katzin, A.M.,
Antimalarial use of volatile oil from leaves of Virola surinamensis (Rol.) Warb. by Waiãpi Amazon Indians,
J. Ethnopharmacol., 1999, 67, 3, 313-319, https://doi.org/10.1016/S0378-8741(99)00072-0
. [all data]
Sajjadi and Ghassemi, 1999
Sajjadi, S.E.; Ghassemi, N.,
Volatile constituents of Nepeta glomerulosa Boiss. subsp. carmanica,
Flavour Fragr. J., 1999, 14, 5, 265-267, https://doi.org/10.1002/(SICI)1099-1026(199909/10)14:5<265::AID-FFJ822>3.0.CO;2-A
. [all data]
Siani, Ramos, et al., 1999
Siani, A.C.; Ramos, M.F.S.; Menezes-de-Lima, O., Jr.; Ribeiro-dos-Santos, R.; Fernadez-Ferreira, E.; Soares, R.O.A.; Rosas, E.C.; Susunaga, G.S.; Guimarães, A.C.; Zoghbi, M.G.B.; Henriques, M.G.M.O.,
Evaluation of anti-inflammatory-related activity of essential oils from the leaves and resin of species of Protium,
J. Ethnopharmacol., 1999, 66, 1, 57-69, https://doi.org/10.1016/S0378-8741(98)00148-2
. [all data]
da Silva, Andrade, et al., 1999
da Silva, M.H.L.; Andrade, E.H.A.; Zoghbi, M.G.B.; Luz, A.I.R.; da Silva, J.D.; Maia, J.G.S.,
The essential oils of Lantana camara L. occurring in North Brazil,
Flavour Fragr. J., 1999, 14, 4, 208-210, https://doi.org/10.1002/(SICI)1099-1026(199907/08)14:4<208::AID-FFJ811>3.0.CO;2-F
. [all data]
Mallavarapu, Rao, et al., 1998
Mallavarapu, G.R.; Rao, B.R.R.; Kaul, P.N.; Ramesh, S.; Bhattacharya, A.K.,
Volatile constituents of the essential oils of the seeds and the herb of palmarosa (Cymbopogon martinii (Roxb.) Wats. var. motia Burk.),
Flavour Fragr. J., 1998, 13, 3, 167-169, https://doi.org/10.1002/(SICI)1099-1026(199805/06)13:3<167::AID-FFJ719>3.0.CO;2-B
. [all data]
Senatore, Urrunaga Soria, et al., 1998
Senatore, F.; Urrunaga Soria, E.; Urrunaga Soria, R.; Porta, G.D.; de Feo, V.,
Essential oil from two peruvian Satureja species,
Flavour Fragr. J., 1998, 13, 1, 1-4, https://doi.org/10.1002/(SICI)1099-1026(199801/02)13:1<1::AID-FFJ672>3.0.CO;2-4
. [all data]
Fiorini, Fourasté, et al., 1997
Fiorini, C.; Fourasté, I.; David, B.; Bessière, J.M.,
Composition of the flower, leaf, and stem essential oils from Laurus nobilis L.,
Flavour Fragr. J., 1997, 12, 2, 91-93, https://doi.org/10.1002/(SICI)1099-1026(199703)12:2<91::AID-FFJ623>3.0.CO;2-3
. [all data]
Jantan, Ali, et al., 1995
Jantan, I.; Ali, N.A.M.; Ahmad, A.S.; Ahmad, A.R.,
Constituents of the essential oil of Leptospermum javanicum blume from peninsular Malaysia,
Flavour Fragr. J., 1995, 10, 4, 255-258, https://doi.org/10.1002/ffj.2730100406
. [all data]
Loayza, Abujder, et al., 1995
Loayza, I.; Abujder, D.; Aranda, R.; Jakupovic, J.; Collin, G.; Deslauriers, H.; Jean, F.-I.,
Essential oils of Baccharis salicifolia, B. latifolia and B. dracunculifolia,
Phytochemistry, 1995, 38, 2, 381-389, https://doi.org/10.1016/0031-9422(94)00628-7
. [all data]
Raharivelomanana, Cambon, et al., 1993
Raharivelomanana, P.; Cambon, A.; Azzaro, M.; Bianchini, J.-P.; Claude-Lafontaine, A.; George, G.,
Volatile Constituents of Neocallitropsis pancheri (Carriere) de Laubenfels Heartwood Extracts (Cupressaceae),
J. Essent. Oil Res., 1993, 5, 6, 587-595, https://doi.org/10.1080/10412905.1993.9698289
. [all data]
Wong and Tie, 1993
Wong, K.C.; Tie, D.Y.,
The Essential Oil of the Leaves of Murraya koenigii Spreng.,
J. Essent. Oil Res., 1993, 5, 4, 371-374, https://doi.org/10.1080/10412905.1993.9698245
. [all data]
de Marchese, de Heluani, et al., 2007
de Marchese, M.J.A.; de Heluani, C.S.; Catalán, C.A.N.; Griffin, C.A.; Vaughn, J.B., Jr.; Herz, W.,
Incisol, an alcohol with a novel sesquiterpene skeleton from Xenophyllum incisum,
Biochem. Syst. Ecol., 2007, 35, 3, 169-175, https://doi.org/10.1016/j.bse.2006.10.006
. [all data]
Sibanda, Chigwada, et al., 2004
Sibanda, S.; Chigwada, G.; Poole, M.; Gwebu, E.T.; Noletto, J.A.; Schmidt, J.M.; Rea, A.I.; Setzer, W.N.,
Composition and bioactivity of the leaf essential oil of Heteropyxis dehniae from Zimbabwe,
J. Ethnopharmacol., 2004, 92, 1, 107-111, https://doi.org/10.1016/j.jep.2004.02.010
. [all data]
Araújo, Silveira, et al., 2003
Araújo, E.C.C.; Silveira, E.R.; Lima, M.A.S.; Neto, M.A.; de Andrade, I.L.; Lima, M.A.A.; Santiago, G.M.P.; Mesquita, A.L.M.,
Insecticidal activity and chemical composition of volatile oils from Hyptis martiusii Benth,
J. Agric. Food Chem., 2003, 51, 13, 3760-3762, https://doi.org/10.1021/jf021074s
. [all data]
Novak, Zitterl-Eglseer, et al., 2001
Novak, J.; Zitterl-Eglseer, K.; Deans, S.G.; Franz, C.M.,
Essential oils of different cultivars of Cannabis sativa L. and their antimicrobial activity,
Flavour Fragr. J., 2001, 16, 4, 259-262, https://doi.org/10.1002/ffj.993
. [all data]
Dickens J.C., 2000
Dickens J.C.,
Sexual maturation and temporal variation of neural responses in adult Colorado potato beetles to volatiles emitted by potato plants,
J. Chem. Ecol., 2000, 26, 5, 1265-1279, https://doi.org/10.1023/A:1005492229377
. [all data]
Khouri, Usubillaga, et al., 2000
Khouri, N.; Usubillaga, A.; Rojas, L.B.; Galarraga, F.,
The essential oil of Espeletia weddellii Sch. Bip. ex Wedd.,
Flavour Fragr. J., 2000, 15, 4, 263-265, https://doi.org/10.1002/1099-1026(200007/08)15:4<263::AID-FFJ907>3.0.CO;2-Q
. [all data]
Maia, Andrade, et al., 2000
Maia, J.G.S.; Andrade, E.H.A.; Zoghbi, M.G.B.,
Volatile constituents of the leaves, fruits and flowers of cashew ( Anacardium occidentaleL.),
J. Food Comp. Anal., 2000, 13, 3, 227-232, https://doi.org/10.1006/jfca.2000.0894
. [all data]
Roscigno, 1998
Roscigno, G.,
Estrazione supercritica di principi farmaceutici e biopesticidi, Tesi di Laurea, Universita degli Studi di Salerno, Salerno, Italy, 1998, 121. [all data]
Andersen and Falcone, 1969
Andersen, N.H.; Falcone, M.S.,
The identification of sesquiterpene hydrocarbons from gas-liquid chromatography retention data,
J. Chromatogr., 1969, 44, 52-59, https://doi.org/10.1016/S0021-9673(01)92497-5
. [all data]
Randriamiharisoa and Gaydou, 1987
Randriamiharisoa, R.P.; Gaydou, E.M.,
Composition of Palmarosa (Cymbopogon martinii) essential oil from Madagascar,
J. Agric. Food Chem., 1987, 35, 1, 62-66, https://doi.org/10.1021/jf00073a015
. [all data]
Baccouri, Ben Temime, et al., 2007
Baccouri, B.; Ben Temime, S.; Campeol, E.; Cioni, P.L.; Daoud, D.; Zarrouk, M.,
Application of solid-phase microextraction to the analysis of volatile compounds in virgin olive oils from five new cultivars,
Food Chem., 2007, 102, 3, 850-856, https://doi.org/10.1016/j.foodchem.2006.06.012
. [all data]
Dehghan, Solaimanian, et al., 2007
Dehghan, G.; Solaimanian, R.; Shahverdi, A.R.; Amin, G.; Abdollahi, M.; Shafiee, A.,
Chemical composition and antimicrobial activity of essential oil of Ferula szovitsiana D.C.,
Flavour Fragr. J., 2007, 22, 3, 224-227, https://doi.org/10.1002/ffj.1789
. [all data]
Flamini, Cioni, et al., 2007
Flamini, G.; Cioni, P.L.; Morelli, I.; Bader, A.,
Essential oils of the aerial parts of three Salvia species from Jordan: Salvia lanigera, S. spinosa and S. syriaca,
Food Chem., 2007, 100, 2, 732-735, https://doi.org/10.1016/j.foodchem.2005.10.032
. [all data]
Kundakovic, Fokialakis, et al., 2007
Kundakovic, T.; Fokialakis, N.; Kovacevic, N.; Chinou, I.,
Essential oil composition of Achillea lingulata and A. umbellata,
Flavour Fragr. J., 2007, 22, 3, 184-187, https://doi.org/10.1002/ffj.1778
. [all data]
Martins, Santos, et al., 2007
Martins, F.T.; Santos, M.H.; Polo, M.; Barbosa, L.C.A.,
Effects of the interactions among macronutrients, plant age and photoperiod in the composition of Hyptis suaveolens (L.) Poit essential oil from Alfenas (MG), Brazil,
Flavour Fragr. J., 2007, 22, 2, 123-129, https://doi.org/10.1002/ffj.1769
. [all data]
Melo, Corrêa, et al., 2007
Melo, R.M.; Corrêa, V.F.S.; Amorim, A.C.L.; Miranda, A.L.P.; Rezende, C.M.,
Identification of Impact Aroma Compounds in Eugenia uniflora L. (Brazilian Pitanga) Leaf Essential Oil,
J. Braz. Chem. Soc., 2007, 18, 1, 179-183, https://doi.org/10.1590/S0103-50532007000100020
. [all data]
Paolini, Muselli, et al., 2007
Paolini, J.; Muselli, A.; Bernardini, A.-F.; Bighelli, A.; Casanova, J.; Costa, J.,
Thymol derivatives from essential oil of Doronicum corsicum L.,
Flavour Fragr. J., 2007, 22, 6, 479-487, https://doi.org/10.1002/ffj.1824
. [all data]
Quijano, Salamanca, et al., 2007
Quijano, C.E.; Salamanca, G.; Pino, J.A.,
Aroma volatile constituents of Colombian varieties of mango (Mangifera indica L.),
Flavour Fragr. J., 2007, 22, 5, 401-406, https://doi.org/10.1002/ffj.1812
. [all data]
Saroglou, Arfan, et al., 2007
Saroglou, V.; Arfan, M.; Shabir, A.; Hadjipavlou-Litina, D.; Skaltsa, H.,
Composition and antioxidant activity of the essential oil of Teucrium royleanum Wall. ex Benth growing in Pakistan,
Flavour Fragr. J., 2007, 22, 2, 154-157, https://doi.org/10.1002/ffj.1774
. [all data]
Saroglou, Marin, et al., 2007
Saroglou, V.; Marin, P.D.; Rancic, A.; Veljic, M.; Skaltsa, H.,
Composition and antimicrobial activity of the essential oil of six Hypericum species from Serbia,
Biochem. Syst. Ecol., 2007, 35, 3, 146-152, https://doi.org/10.1016/j.bse.2006.09.009
. [all data]
Simoniatto, Bonani, et al., 2007
Simoniatto, E.; Bonani, V.F.L.; Morel, A.F.; Poppi, N.R.; Raposo, J.L., Jr.; Stuker, C.Z.; Peruzzo, G.M.; Peres, M.T.L.P.; Hess, S.C.,
Chemical composition and evaluation of antibacterial and antioxidant activities of the essential oil of Croton urucurana Baillon (Euphorbiaceae) stem bark,
J. Braz. Chem., 2007, 18, 5, 879-885, https://doi.org/10.1590/S0103-50532007000500002
. [all data]
Telascrea, de Araujo, et al., 2007
Telascrea, M.; de Araujo, C.C.; Marques, M.O.M.; Facanali, R.; de Moraes, P.L.R.; Cavalheiro, A.J.,
Essential oil from leaves of Cryptocarya mandioccana Meisner (Lauraceae): Composition and intraspecific chemical variability,
Biochem. Syst. Ecol., 2007, 35, 4, 222-232, https://doi.org/10.1016/j.bse.2006.09.015
. [all data]
Vagionas, Ngassapa, et al., 2007
Vagionas, K.; Ngassapa, O.; Runyoro, D.; Graikou, K.; Gortzi, O.; Chinou, I.,
Chemical analysis of edible aromatic plants growing in Tanzania,
Food Chem., 2007, 105, 4, 1711-1717, https://doi.org/10.1016/j.foodchem.2007.05.029
. [all data]
Zeng, Zhao, et al., 2007
Zeng, Y.-X.; Zhao, C.-X.; Liang, Y.-Z.; Yang, H.; Fang, H.-Z.; Yi, L.-Z.; Zeng, Z.-D.,
Comparative analysis of volatile components from Clematis species growing in China,
Anal. Chim. Acta., 2007, 595, 1-2, 328-339, https://doi.org/10.1016/j.aca.2006.12.022
. [all data]
Blanc, Bradesi, et al., 2006
Blanc, M.-C.; Bradesi, P.; Goncalves, M.J.; Salgueiro, L.; Casanova, J.,
Essential oil of Dittrichia viscosa ssp. viscosa: analysis by 13C-NMR and antimicrobial activity,
Flavour Fragr. J., 2006, 21, 2, 324-332, https://doi.org/10.1002/ffj.1605
. [all data]
Blagojevic, Radulovic, et al., 2006
Blagojevic, P.; Radulovic, N.; Palic, R.; Stojanovic, G.,
Chemical composition of the essential oils of Serbian wild-growing Srtemisia absinthium and Artemisia vulgaris,
J. Agric. Food Chem., 2006, 54, 13, 4780-4789, https://doi.org/10.1021/jf060123o
. [all data]
Bousmaha, Boti, et al., 2006
Bousmaha, L.; Boti, J.B.; Bekkara, F.A.; Castola, V.; Casanova, J.,
Infraspecific chemical variability of the essential oil of Lavandula dentata L. from Algeria,
Flavour Fragr. J., 2006, 21, 2, 368-372, https://doi.org/10.1002/ffj.1659
. [all data]
Cavalli, Tomi, et al., 2006
Cavalli, J.-F.; Tomi, F.; Bernardini, A.-F.; Casanova, J.,
Chemical variability of the essential oil of Helichrysum faradifani Sc. Ell. from Madagascar,
Flavour Fragr. J., 2006, 21, 1, 111-114, https://doi.org/10.1002/ffj.1531
. [all data]
Duquesnoy, Dinh, et al., 2006
Duquesnoy, E.; Dinh, N.H.; Castola, V.; Casanova, J.,
Composition of a Pyrolytic oil from Cupressus funebris Endl. of Vietnamese origin,
Flavour Fragr. J., 2006, 21, 3, 453-457, https://doi.org/10.1002/ffj.1676
. [all data]
Flamini, Tebano, et al., 2006
Flamini, G.; Tebano, M.; Cioni, P.L.; Bagci, Y.; Dural, H.; Ertugrul, K.; Uysal, T.; Savran, A.,
A multivariate statistical approach to Centaurea classification using essential oil composition data of some species from Turkey,
Pl. Syst. Evol., 2006, 261, 1-4, 217-228, https://doi.org/10.1007/s00606-006-0448-3
. [all data]
Gonny, Cavaleiro, et al., 2006
Gonny, M.; Cavaleiro, C.; Salgueiro, L.; Casanova, J.,
Analysis of Juniperus communis subsp. alpina needle, berry, wood and root oils by combination of GC, GC/MS and 13C-NMR,
Flavour Fragr. J., 2006, 21, 1, 99-106, https://doi.org/10.1002/ffj.1527
. [all data]
Javidnia K., Miri R., et al., 2006
Javidnia K.; Miri R.; Javidnia A.,
Constituents of the essential oil of Scabiosa flavida from Iran,
Chem. Nat. Compd. (Engl. Transl.), 2006, 42, 5, 529-530, https://doi.org/10.1007/s10600-006-0206-3
. [all data]
Kuiate, Bessière, et al., 2006
Kuiate, J.R.; Bessière, J.M.; Vilarem, G.; Amvam Zollo, P.H.,
Chemical composition and antidermatophytic properties of the essential oils from leaves, flowers and fruits of Cupressus lusitanica Mill. from Cameroon,
Flavour Fragr. J., 2006, 21, 4, 693-697, https://doi.org/10.1002/ffj.1686
. [all data]
Masoudi, Esmaeili, et al., 2006
Masoudi, S.; Esmaeili, A.; Khalilzadeh, M.A.; Rustaiyan, A.; Moazami, N.; Akhgar, M.R.; Varavipoor, M.,
Volatile constituents of Dorema aucheri Boiss., Seseli libanotis (L.) W. D. Koch var. armeniacum bordz. and Conium maculatum L. three Umbelliferae herbs growing wild in Iran,
Flavour Fragr. J., 2006, 21, 5, 801-804, https://doi.org/10.1002/ffj.1722
. [all data]
Paolini J., Desjobert J.M., et al., 2006
Paolini J.; Desjobert J.M.; Costa J.; Bernardini A.F.; Castellini C.B.; Cioni P.L.; Flamini G.; Morelli I.,
Composition of essential oils of Helichrysum italicum (Roth) G. Don fil subsp. italicum from Tuscan archipelago islands,
Flavour Fragr. J., 2006, 21, 5, 805-808, https://doi.org/10.1002/ffj.1726
. [all data]
Pavlovic, Tzakou, et al., 2006
Pavlovic, M.; Tzakou, O.; Petrakis, P.V.; Couladis, M.,
The essential oil of Hypericum perforatum L., Hypericum tetrapterum Fries and Hypericum olympicum L. growing in Greece,
Flavour Fragr. J., 2006, 21, 1, 84-87, https://doi.org/10.1002/ffj.1521
. [all data]
Ramezani, Behravan, et al., 2006
Ramezani, M.; Behravan, J.; Yazdinezhad, A.,
Composition and antimicrobial activity of the volatile oil of Artemisia kopetdaghensis Krasch., M.Pop. Linecz ex Poljak from Iran,
Flavour Fragr. J., 2006, 21, 6, 869-871, https://doi.org/10.1002/ffj.1644
. [all data]
Rubiolo P., Matteodo M., et al., 2006
Rubiolo P.; Matteodo M.; Riccio G.; Ballero M.; Christen P.; Fleury-Souverain S.; Veuthey J.L.; Bicchi C.,
Analytical discrimination of poisonous and nonpoisonous chemotypes of giant fennel (Ferula communis L.) through their biologically active and volatile fractions,
J. Agric. Food Chem., 2006, 54, 20, 7556-7563, https://doi.org/10.1021/jf061592t
. [all data]
Saroglou, Dorizas, et al., 2006
Saroglou, V.; Dorizas, N.; Kypriotakis, Z.; Skaltsa, H.D.,
Analysis of the essential oil composition of eight Anthemis species from Greece,
J. Chromatogr. A, 2006, 1104, 1-2, 313-322, https://doi.org/10.1016/j.chroma.2005.11.087
. [all data]
Silva-Brandão, Solferini, et al., 2006
Silva-Brandão, K.L.; Solferini, V.N.; Trigo, J.R.,
Chemical and phylogenetic relationships among Aristolochia L. (Aristolochiaceae) from southeastern Brazil,
Biochem. Syst. Ecol., 2006, 34, 4, 291-302, https://doi.org/10.1016/j.bse.2005.10.011
. [all data]
Agnaniet, Makani, et al., 2005
Agnaniet, H.; Makani, T.; Akagah, A.; Menut, C.; Bessière, J.M.,
Volatile constituents and antioxidant activity of essential oils from Lippia multiflora Mold. growing in Gabon,
Flavour Fragr. J., 2005, 20, 1, 34-38, https://doi.org/10.1002/ffj.1383
. [all data]
Celik, Gokturk, et al., 2005
Celik, S.; Gokturk, R.S.; Flamini, G.; Cioni, P.L.; Morelli, I.,
Essential oils of Phlomis leucophracta, Phlomis chimerae and Phlomis grandiflora var. grandiflora from Turkey,
Biochem. Syst. Ecol., 2005, 33, 6, 617-623, https://doi.org/10.1016/j.bse.2004.11.010
. [all data]
Dob, Berramdane, et al., 2005
Dob, T.; Berramdane, T.; Dahmane, D.; Chelghoum, C.,
Chemical composition of the needles oil of Pinus canariensis from Algeria,
Chem. Nat. Compd. (Engl. Transl.), 2005, 41, 2, 165-167, https://doi.org/10.1007/s10600-005-0103-1
. [all data]
Estevez, Ventanas, et al., 2005
Estevez, M.; Ventanas, S.; Ramirez, R.; Cava, R.,
Influence of the Addition of Rosemary Essential Oil on the Volatiles Pattern of Porcine Frankfurters,
J. Agric. Food Chem., 2005, 53, 21, 8317-8324, https://doi.org/10.1021/jf051025q
. [all data]
Fanciullino, Gancel, et al., 2005
Fanciullino, A.-L.; Gancel, A.-L.; Froelicher, Y.; Luro, F.; Ollitrault, P.; Brillouet, J.-M.,
Effects of Nucleo-cytoplasmic Interactions on Leaf Volatile Compounds from Citrus Somatic Diploid Hybrids,
J. Agric. Food Chem., 2005, 53, 11, 4517-4523, https://doi.org/10.1021/jf0502855
. [all data]
Ferrari, Tomi, et al., 2005
Ferrari, B.; Tomi, F.; Casanova, J.,
Composition and chemical variability of Ferula communis essential oil from Corsica,
Flavour Fragr. J., 2005, 20, 2, 180-185, https://doi.org/10.1002/ffj.1405
. [all data]
Flamini, Luigi Cioni, et al., 2005
Flamini, G.; Luigi Cioni, P.; Morelli, I.,
Composition of the essential oils and in vivo emission of volatiles of four Lamium species from Italy: L. purpureum, L. hybridum, L. bifidum and L. amplexicaule,
Food Chem., 2005, 91, 1, 63-68, https://doi.org/10.1016/j.foodchem.2004.05.047
. [all data]
Gancel, Ollitrault, et al., 2005
Gancel, A.-L.; Ollitrault, P.; Froelicher, Y.; Tomi, F.; Jacquemond, C.; Luro, F.; Brillouet, J.-M.,
Leaf volatile compounds of six citrus somatic allotetraploid hybrids originating from various combinations of lime, lemon, citron, sweet orange, and grapefruit,
J. Agric. Food Chem., 2005, 53, 6, 2224-2230, https://doi.org/10.1021/jf048315b
. [all data]
bin Jantan, Yalvema, et al., 2005
bin Jantan, I.; Yalvema, M.F.; Ahmad, N.W.; Jamal, J.A.,
Insecticidal activities of the leaf oils of eight Cinnamomum species against Aedes aegypti and Aedes albopictus,
Pharm. Biol., 2005, 43, 6, 526-532, https://doi.org/10.1080/13880200500220771
. [all data]
bin Jantan, Yalvema, et al., 2005, 2
bin Jantan, I.; Yalvema, M.F.; Ayop, N.; Ahmad, A.S.,
Constituents of the essential oils of Cinnamomum sintoc Blume from a mountain forest of Peninsular Malaysia,
Flavour Fragr. J., 2005, 20, 6, 601-604, https://doi.org/10.1002/ffj.1495
. [all data]
Javidnia, Miri, et al., 2005
Javidnia, K.; Miri, R.; Jamalian, A.,
Composition of the essential oil of Salvia macrosiphon Boiss. from Iran,
Flavour Fragr. J., 2005, 20, 5, 542-543, https://doi.org/10.1002/ffj.1468
. [all data]
Pino, Mesa, et al., 2005
Pino, J.A.; Mesa, J.; Muñoz, Y.; Martí, M.P.; Marbot, R.,
Volatile components from mango (Mangifera indica L.) cultivars,
J. Agric. Food Chem., 2005, 53, 6, 2213-2223, https://doi.org/10.1021/jf0402633
. [all data]
Seo and Baek, 2005
Seo, W.H.; Baek, H.H.,
Identification of characteristic aroma-active compounds from water dropword (Oenanthe javanica DC.),
J. Agric. Food Chem., 2005, 53, 17, 6766-6770, https://doi.org/10.1021/jf050150z
. [all data]
Tchoumbougnang, Zollo, et al., 2005
Tchoumbougnang, F.; Zollo, P.H.A.; Boyom, F.F.; Nyegue, M.A.; Bessière, J.M.; Menut, C.,
Aromatic plants of tropical Central Africa. XLVIII. Comparative study of the essential oils of four Hyptis species from Cameroon: H. lanceolata Poit., H. pectinata (L.) Poit., H. spicigera Lam. and H. suaveolens Poit.,
Flavour Fragr. J., 2005, 20, 3, 340-343, https://doi.org/10.1002/ffj.1441
. [all data]
Vellutini, Baldovini, et al., 2005
Vellutini, M.; Baldovini, N.; de Rocca Serra, D. Tomi; Casanova, J.,
β-Cyclolavandulyl and β-isocyclolavandulyl esters from Peucedanum paniculatum L., an endemic species to Corsica,
Phytochemistry, 2005, 66, 16, 1956-1962, https://doi.org/10.1016/j.phytochem.2005.07.001
. [all data]
Cavaleiro, Salgueiro, et al., 2004
Cavaleiro, C.; Salgueiro, L.R.; Miguel, M.G.; da Cunha, A.P.,
Analysis by gas chromatography?mass spectrometry of the volatile components of Teucrium lusitanicum and Teucrium algarbiensis,
J. Chromatogr. A, 2004, 1033, 1, 187-190, https://doi.org/10.1016/j.chroma.2004.01.005
. [all data]
Chorianopoulos, Kalpoutzakis, et al., 2004
Chorianopoulos, N.; Kalpoutzakis, E.; Aligiannis, N.; Mitaku, S.; Nychas, G.-J.; Haroutounian, S.A.,
Essential oils of Satureja, Origanum, and Thymus species: chemical composition and antibacterial activities against foodborne pathogens,
J. Agric. Food Chem., 2004, 52, 26, 8261-8267, https://doi.org/10.1021/jf049113i
. [all data]
Flamini, Cioni, et al., 2004
Flamini, G.; Cioni, P.L.; Morelli, I.; Maccioni, S.; Baldini, R.,
Phytochemical typologies in some populations of Myrtus communis L. on Caprione Promontory (East Liguria, Italy),
Food Chem., 2004, 85, 4, 599-604, https://doi.org/10.1016/j.foodchem.2003.08.005
. [all data]
Gonny, Bradesi, et al., 2004
Gonny, M.; Bradesi, P.; Casanova, J.,
Identification of the components of the essential oil from wild Corsican Daucus carota L. using 13C-NMR spectroscopy,
Flavour Fragr. J., 2004, 19, 5, 424-433, https://doi.org/10.1002/ffj.1330
. [all data]
Grujic-Jovanovic, Skaltsa, et al., 2004
Grujic-Jovanovic, S.; Skaltsa, H.D.; Marin, P.; Sokovic, M.,
Composition and antibacterial activity of the essential oil of six Stachys species from Serbia,
Flavour Fragr. J., 2004, 19, 2, 139-144, https://doi.org/10.1002/ffj.1275
. [all data]
Isidorov, Krajewska, et al., 2004
Isidorov, V.A.; Krajewska, U.; Vinogorova, V.T.; Vetchinnikova, L.V.; Fuksman, I.L.; Bal, K.,
Gas chromatographic analysis of essential oil from buds of different birch species with preliminary partition of components,
Biochem. Syst. Ecol., 2004, 32, 1, 1-13, https://doi.org/10.1016/S0305-1978(03)00175-3
. [all data]
Javidnia, Miri, et al., 2004
Javidnia, K.; Miri, R.; Kamalinejad, M.; Sarkarzadeh, H.; Jamalian, A.,
Chemical composition of the essential oils of Anthemis altissima L. grown in Iran,
Flavour Fragr. J., 2004, 19, 3, 213-216, https://doi.org/10.1002/ffj.1277
. [all data]
Karioti, Hadjipavlou-Litina, et al., 2004
Karioti, A.; Hadjipavlou-Litina, D.; Mensah, M.L.K.; Fleischer, T.C.; Skaltsa, H.,
Composition and antioxidant activity of the essential oils of Xylopia aethiopica (Dun) A. Rich. (Annonaceae) leaves, stem bark, root bark, and fresh and dried fruits, growing in Ghana,
J. Agric. Food Chem., 2004, 52, 26, 8094-8098, https://doi.org/10.1021/jf040150j
. [all data]
Pino, Marbot, et al., 2004
Pino, J.A.; Marbot, R.; Rosado, A.; Vázquez, C.,
Volatile constituents of Malay rose apple [Syzygium malaccense (L.) Merr. Perry],
Flavour Fragr. J., 2004, 19, 1, 32-35, https://doi.org/10.1002/ffj.1269
. [all data]
Tam, Thuam, et al., 2004
Tam, N.T.; Thuam, D.T.; Bighelli, A.; Castola, V.; Muselli, A.; Richomme, P.; Casanova, J.,
Baeckea frutescens leaf oil from Vietnam: composition and chemical variability,
Flavour Fragr. J., 2004, 19, 3, 217-220, https://doi.org/10.1002/ffj.1281
. [all data]
Vérité, Nacer, et al., 2004
Vérité, P.; Nacer, A.; Kabouche, Z.; Seguin, E.,
Composition of seeds and stems essential oils of Pituranthos scoparius (Coss. Dur.) Schinz,
Flavour Fragr. J., 2004, 19, 6, 562-564, https://doi.org/10.1002/ffj.1353
. [all data]
Yu, Kim, et al., 2004
Yu, E.J.; Kim, T.H.; Kim, K.H.; Lee, H.J.,
Aroma-active compounds of Pinus densiflora (red pine) needles,
Flavour Fragr. J., 2004, 19, 6, 532-537, https://doi.org/10.1002/ffj.1337
. [all data]
bin Ahmad and bin Jantan, 2003
bin Ahmad, F.; bin Jantan, I.,
Chemical constituents of the essential oils of Goniothalamus uvariodes King,
Flavour Fragr. J., 2003, 18, 2, 128-130, https://doi.org/10.1002/ffj.1142
. [all data]
bin Ahmad and bin Jantan, 2003, 2
bin Ahmad, F.; bin Jantan, I.,
The essential oils of Boesenbergia stenophylla R. M. Sm. as natural sources of methyl (E)-cinnamate,
Flavour Fragr. J., 2003, 18, 6, 485-486, https://doi.org/10.1002/ffj.1227
. [all data]
Bader, Flamini, et al., 2003
Bader, A.; Flamini, G.; Cioni, P.L.; Morelli, I.,
Essential oil composition of Achillea santolina L. and Achillea biebersteinii Afan. collected in Jordan,
Flavour Fragr. J., 2003, 18, 1, 36-38, https://doi.org/10.1002/ffj.1147
. [all data]
Bianchini, Tomi, et al., 2003
Bianchini, A.; Tomi, P.; Bernardini, A.F.; Morelli, I.; Flamini, G.; Cioni, P.L.; Usai, M.; Marchetti, M.,
A comparative study of volatile constituents of two Helichrysum italicum (Roth) Guss. Don Fil subspecies growing in Corsica (France), Tuscany and Sardinia (Italy),
Flavour Fragr. J., 2003, 18, 6, 487-491, https://doi.org/10.1002/ffj.1231
. [all data]
Bougatsos, Meyer, et al., 2003
Bougatsos, C.; Meyer, J.J.M.; Magiatis, P.; Vagias, C.; Chinou, I.B.,
Composition and antimicrobial activity of the essential oils of Helichrysum kraussii Sch. Bip. and H. rugulosum Less. from south Africa,
Flavour Fragr. J., 2003, 18, 1, 48-51, https://doi.org/10.1002/ffj.1152
. [all data]
Campeol, Flamini, et al., 2003
Campeol, E.; Flamini, G.; Cioni, P.L.; Morelli, I.; Cremonini, R.; Ceccarini, L.,
Volatile fractions from three cultivars of Olea eruopaea L. collected in two different seasons,
J. Agric. Food Chem., 2003, 51, 7, 1994-1999, https://doi.org/10.1021/jf026025u
. [all data]
Cavaleiro, Salgueiro, et al., 2003
Cavaleiro, C.; Salgueiro, L.R.; da Cunha, A.P.; Figueiredo, A.C.; Barroso, J.G.; Bighelli, A.; Casanova, J.,
Composition and variability of the essential oils of the leaves and berries from Juniperus navicularis,
Biochem. Syst. Ecol., 2003, 31, 2, 193-201, https://doi.org/10.1016/S0305-1978(02)00080-7
. [all data]
Cavalli, Tomi, et al., 2003
Cavalli, J.-F.; Tomi, F.; Bernardini, A.-F.; Casanova, J.,
Composition and chemical variability of the bark oil of Cedrelopsis grevei H. Baillon from Madagascar,
Flavour Fragr. J., 2003, 18, 6, 532-538, https://doi.org/10.1002/ffj.1263
. [all data]
Ceva-Antunes, Bizzo, et al., 2003
Ceva-Antunes, P.M.N.; Bizzo, H.R.; Alves, S.M.; Antunes, O.A.C.,
Analysis of volatile compounds of taperebá (Spondias mombin L.) and Cajá (Spondias mombin L.) by simultaneous distillation and extraction (SDE) and solid phase microextraction (SPME),
J. Agric. Food Chem., 2003, 51, 5, 1387-1392, https://doi.org/10.1021/jf025873m
. [all data]
Dural, Bagci, et al., 2003
Dural, H.; Bagci, Y.; Ertugrul, K.; Demirelma, H.; Flamini, G.; Cioni, P.L.; Morelli, I.,
Essential oil composition of two endemic Centaurea species from Turkey, Centaurea mucronifera and Centaurea chrysantha, collected in the same habitat,
Biochem. Syst. Ecol., 2003, 31, 12, 1417-1425, https://doi.org/10.1016/S0305-1978(03)00128-5
. [all data]
Ertugrul, Dural, et al., 2003
Ertugrul, K.; Dural, H.; Tugay, O.; Flamini, G.; Cioni, P.L.; Morelli, I.,
Essential oils from flowers of Centaurea kotschyi var. kotschyi and C. kotschyi var. decumbens from Turkey,
Flavour Fragr. J., 2003, 18, 2, 95-97, https://doi.org/10.1002/ffj.1168
. [all data]
de Feo, Bruno, et al., 2003
de Feo, V.; Bruno, M.; Tahiri, B.; Napolitano, F.; Senatore, F.,
Chemical composition and antibacterial activity of essential oils from Thymus spinulosus Ten. (Lamiaceae),
J. Agric. Food Chem., 2003, 51, 13, 3849-3853, https://doi.org/10.1021/jf021232f
. [all data]
Flamini, Luigi Cioni, et al., 2003
Flamini, G.; Luigi Cioni, P.; Morelli, I.,
Differences in the fragrances of pollen, leaves, and floral parts of garland (Chrysanthemum coronarium) and composition of the essential oils from flowerheads and leaves,
J. Agric. Food Chem., 2003, 51, 8, 2267-2271, https://doi.org/10.1021/jf021050l
. [all data]
Gancel, Ollitrault, et al., 2003
Gancel, A.-L.; Ollitrault, P.; Froelicher, Y.; Tomi, F.; Jacquemond, C.; Luro, F.; Brillouet, J.-M.,
Leaf volatile compounds of seven citrus somatic tetraploid hybrids sharing willow leaf mandarin (Citrus deliciosa Ten.) as their common parent,
J. Agric. Food Chem., 2003, 51, 20, 6006-6013, https://doi.org/10.1021/jf0345090
. [all data]
Isidorov and Vinogorova, 2003
Isidorov, V.A.; Vinogorova, V.T.,
GC-MS analysis of compounds extracted from buds of Populus balsamifera and Populus nigra,
Z. Naturforsch. C:, 2003, 58, 355-360. [all data]
Isidorov, Vinogorova, et al., 2003
Isidorov, V.A.; Vinogorova, V.T.; Rafalowski, K.,
HS-SPME analysis of volatile organic compounds of coniferous needle litter,
Atmos. Environ., 2003, 37, 33, 4645-4650, https://doi.org/10.1016/j.atmosenv.2003.07.005
. [all data]
Jantan, Ling, et al., 2003
Jantan, I.; Ling, Y.E.; Romli, S.; Ayop, N.; Ahmad, A.S.,
A comparative study of the constituents of the essential oils of three Cinnamomum species from Malaysia,
J. Essent. Oil Res., 2003, 15, 6, 387-391, https://doi.org/10.1080/10412905.2003.9698618
. [all data]
Macchioni, Cioni, et al., 2003
Macchioni, F.; Cioni, P.L.; Flamini, G.; Morelli, I.; Maccioni, S.; Ansaldi, M.,
Chemical composition of essential oils from needles, branches and cones of Pinus pinea, P. halepensis, P. pinaster and P. nigra from central Italy,
Flavour Fragr. J., 2003, 18, 2, 139-143, https://doi.org/10.1002/ffj.1178
. [all data]
Senatore, Lentini, et al., 2003
Senatore, F.; Lentini, F.; Venza, F.; Bruno, M.; Napolitano, F.,
Composition and antibacterial activity of the essential oil of Anisochilus carnosus (Linn. fil.) Benth., a Tamil plant acclimatized in Sicily,
Flavour Fragr. J., 2003, 18, 3, 202-204, https://doi.org/10.1002/ffj.1183
. [all data]
Skaltsa, Demetzos, et al., 2003
Skaltsa, H.D.; Demetzos, C.; Lazari, D.; Sokovic, M.,
Essential oil analysis and antimicrobial activity of eight Stachys species from Greece,
Phytochemistry, 2003, 64, 3, 743-752, https://doi.org/10.1016/S0031-9422(03)00386-8
. [all data]
Tsiri, Kretsi, et al., 2003
Tsiri, D.; Kretsi, O.; Chinou, I.B.; Spyropoulos, C.G.,
Composition of fruit volatiles and annual changes in the volatiles of leaves of Eucalyptus camaldulensis Dehn. growing in Greece,
Flavour Fragr. J., 2003, 18, 3, 244-247, https://doi.org/10.1002/ffj.1220
. [all data]
Cavaleiro, Salgueiro, et al., 2002
Cavaleiro, C.; Salgueiro, L.R.; Antunes, T.; Sevinate-Pinto, I.; Barroso, J.G.,
Composition of the essential oil and micromorphology of trichomes of Teucrium salviastrum, an endemic species from Portugal,
Flavour Fragr. J., 2002, 17, 4, 287-291, https://doi.org/10.1002/ffj.1068
. [all data]
Couladis, Chinou, et al., 2002
Couladis, M.; Chinou, I.B.; Tzakou, O.; Loukis, A.,
Composition and antimicrobial activity of the essential oil of Ballota pseudodictamnus L. Bentham,
Phytother. Res., 2002, 16, 8, 723-726, https://doi.org/10.1002/ptr.1043
. [all data]
Demetzos, Angelopoulou, et al., 2002
Demetzos, C.; Angelopoulou, D.; Perdetzoglou, D.,
A comparative study of the essential oils of Cistus salviifolius in several populations of Crete (Greece),
Biochem. Syst. Ecol., 2002, 30, 7, 651-665, https://doi.org/10.1016/S0305-1978(01)00145-4
. [all data]
Flamini, Cioni, et al., 2002
Flamini, G.; Cioni, P.L.; Morelli, I.,
Analysis of the essential oil of the aerial parts of Viola etrusca from Monte Labbro (South Tuscany, Italy) and in vivo analysis of flower volatiles using SPME,
Flavour Fragr. J., 2002, 17, 2, 147-149, https://doi.org/10.1002/ffj.1060
. [all data]
Flamini, Cioni, et al., 2002, 2
Flamini, G.; Cioni, P.L.; Morelli, I.,
Differences in the fragrances of pollen and different floral parts of male and female flowers of Laurus nobilis,
J. Agric. Food Chem., 2002, 50, 16, 4647-4652, https://doi.org/10.1021/jf020269x
. [all data]
Fokialakis, Magiatis, et al., 2002
Fokialakis, N.; Magiatis, P.; Mitaku, S.,
Essential oil constituents of Valeriana italica and Valeriana tuberosa. Stereochemical and conformational study of 15-acetoxyvaleranone,
Z. Naturforsch., 2002, 57c, 791-796. [all data]
bin Jantan and bin Ahmad, 2002
bin Jantan, I.; bin Ahmad, F.,
Chemical constituents of the essential oils of Goniothalamus malayanus Hook. f. and Thoms.,
Flavour Fragr. J., 2002, 17, 5, 372-374, https://doi.org/10.1002/ffj.1107
. [all data]
Javidnia, Miri, et al., 2002
Javidnia, K.; Miri, R.; Kamalinejad, M.; Nasiri, A.,
Composition of the essential oil of Salvia mirzayanii Rech. f. Esfand from Iran,
Flavour Fragr. J., 2002, 17, 6, 465-467, https://doi.org/10.1002/ffj.1128
. [all data]
Mondello, Zappia, et al., 2002
Mondello, L.; Zappia, G.; Cotroneo, A.; Bonaccorsi, I.; Chowdhury, J.U.; Yusuf, M.; Dugo, G.,
Studies on the essential oil-bearing plants of Bangladesh. Part VIII. Composition of some Ocimum oils O. basilicum L. var. purpurascens; O. sanctum L. green; O. sanctum L. purple; O. americanum L., citral type; O. americanum L., camphor type,
Flavour Fragr. J., 2002, 17, 5, 335-340, https://doi.org/10.1002/ffj.1108
. [all data]
Pino, Marbot, et al., 2002
Pino, J.A.; Marbot, R.; Quert, R.; García, H.,
Study of essential oils of Eucalyptus resinifera Smith, E. tereticornis Smith and Corymbia maculata (Hook.) K.D. Hill L.A.S. Johnson, grown in Cuba,
Flavour Fragr. J., 2002, 17, 1, 1-4, https://doi.org/10.1002/ffj.1026
. [all data]
Pino, Marbot, et al., 2002, 2
Pino, J.A.; Marbot, R.; Bello, A.,
Volatile compounds of Psidium salutare (H.B.K.) Berg. fruit,
J. Agric. Food Chem., 2002, 50, 18, 5146-5148, https://doi.org/10.1021/jf0116303
. [all data]
Pino, Marbot, et al., 2002, 3
Pino, J.A.; Marbot, R.; Vázquez, C.,
Characterization of volatile in Cosa Rican Guava [Psidium friedrichsthalianum (Berg) Niedenzu] fruit,
J. Agric. Food Chem., 2002, 50, 21, 6023-6026, https://doi.org/10.1021/jf011456i
. [all data]
Isidorov, Zenkevich, et al., 2001
Isidorov, V.A.; Zenkevich, I.G.; Krajewska, U.; Dubis, E.N.; Jaroszynska, J.; Bal, K.,
Gas chromatographic analysis of essential oils with preliminary partition of components,
Phytochem. Anal., 2001, 12, 2, 87-90, https://doi.org/10.1002/pca.564
. [all data]
Nogueira, Bittrich, et al., 2001
Nogueira, P.C.L.; Bittrich, V.; Shepherd, G.J.; Lopes, A.V.; Marsaioli, A.J.,
The ecological and taxonomic importance of flower volatiles of Clusia species (Guttiferae),
Phytochemistry, 2001, 56, 5, 443-452, https://doi.org/10.1016/S0031-9422(00)00213-2
. [all data]
Skaltsa, Mavrommati, et al., 2001
Skaltsa, H.D.; Mavrommati, A.; Constantinidis, T.,
A chemotaxonomic investigation of volatile constituents in Stachys subsect. Swainsonianeae (Labiatae),
Phytochemistry, 2001, 57, 2, 235-244, https://doi.org/10.1016/S0031-9422(01)00003-6
. [all data]
Lazari, Skaltsa, et al., 2000
Lazari, D.M.; Skaltsa, H.D.; Constantinidis, T.,
Volatile constituents of Centaurea pelia DC., C. thessala Hausskn. subsp. drakiensis (Freyn Sint.) Georg. and C. zuccariniana DC. from Greece,
Flavour Fragr. J., 2000, 15, 1, 7-11, https://doi.org/10.1002/(SICI)1099-1026(200001/02)15:1<7::AID-FFJ860>3.0.CO;2-3
. [all data]
Maia, de Paula, et al., 2000
Maia, B.H.L.N.S.; de Paula, J.R.; Sant'Ana, J.; da Silva, M.F.G.F.; Fernandes, J.B.; Vieira, P.C.; Costa, M.S.S.; Ohashi, O.S.; Silva, J.N.M.,
Essential oils of Toona and Cedrela species (Meliaceae): Taxonomic and ecological implications,
J. Braz. Chem. Soc., 2000, 11, 6, 629-639, https://doi.org/10.1590/S0103-50532000000600012
. [all data]
Skaltsa, Lazari, et al., 2000
Skaltsa, H.D.; Lazari, D.M.; Loukis, A.E.; Constantinidis, T.,
Essential oil analysis of Nepeta argolica Bory Chaub. subsp. argolica (Lamiaceae) growing wild in Greece,
Flavour Fragr. J., 2000, 15, 2, 96-99, https://doi.org/10.1002/(SICI)1099-1026(200003/04)15:2<96::AID-FFJ873>3.0.CO;2-F
. [all data]
Mazzoni, Tomi, et al., 1999
Mazzoni, V.; Tomi, F.; Casanova, J.,
A daucane-type sesquiterpene from Faucus carota seed oil,
Flavour Fragr. J., 1999, 14, 5, 268-272, https://doi.org/10.1002/(SICI)1099-1026(199909/10)14:5<268::AID-FFJ823>3.0.CO;2-Z
. [all data]
Muselli, Hoi, et al., 1999
Muselli, A.; Hoi, T.M.; Cu, L.D.; Moi, L.D.; Bessière, J.-M.; Bighelli, A.; Casanova, J.,
Composition of the essential oil of Acanthopanax trifoliatus (L.) Merr. (Araliacaea) from Vietnam,
Flavour Fragr. J., 1999, 14, 1, 41-44, https://doi.org/10.1002/(SICI)1099-1026(199901/02)14:1<41::AID-FFJ781>3.0.CO;2-B
. [all data]
Sumathykutty, Rao, et al., 1999
Sumathykutty, M.A.; Rao, J.M.; Padmakumari, K.P.; Narayanan, C.S.,
Essential oil constituents of some Piper species,
Flavour Fragr. J., 1999, 14, 5, 279-282, https://doi.org/10.1002/(SICI)1099-1026(199909/10)14:5<279::AID-FFJ821>3.0.CO;2-0
. [all data]
Weyerstahl, Marschall, et al., 1999
Weyerstahl, P.; Marschall, H.; Wahlburg, H.-C.; Christiansen, C.; Rustaiyan, A.; Mirdjalili, F.,
Constituents of the essential oil of Pulicaria gnaphalodes (Vent.) Boiss. from Iran,
Flavour Fragr. J., 1999, 14, 2, 121-130, https://doi.org/10.1002/(SICI)1099-1026(199903/04)14:2<121::AID-FFJ790>3.0.CO;2-K
. [all data]
Bicchi, Rubiolo, et al., 1998
Bicchi, C.; Rubiolo, P.; Marschall, H.; Weyerstahl, P.; Laurent, R.,
Constituents of Artemisia roxburghiana Besser essential oil,
Flavour Fragr. J., 1998, 13, 1, 40-46, https://doi.org/10.1002/(SICI)1099-1026(199801/02)13:1<40::AID-FFJ688>3.0.CO;2-Z
. [all data]
Bicchi, Fresia, et al., 1997
Bicchi, C.; Fresia, M.; Rubiolo, P.; Monti, D.; Franz, C.; Goehler, I.,
Constituents of Tagetes lucida Cav. ssp. lucida essential oil,
Flavour Fragr. J., 1997, 12, 1, 47-52, https://doi.org/10.1002/(SICI)1099-1026(199701)12:1<47::AID-FFJ610>3.0.CO;2-7
. [all data]
Sagrero-Nieves, Bartley, et al., 1997
Sagrero-Nieves, L.; Bartley, J.P.; Griselda Espinosa, B.; Dominguez, X.A.; Julia Verde S.,
Essential oil composition of Aristolochia brevipes Benth.,
Flavour Fragr. J., 1997, 12, 6, 401-403, https://doi.org/10.1002/(SICI)1099-1026(199711/12)12:6<401::AID-FFJ673>3.0.CO;2-D
. [all data]
Stashenko, Wiame, et al., 1995
Stashenko, E.; Wiame, H.; Dassy, S.; Martinez, J.R.; Shibamoto, T.,
Catalytic transformation of copaiba (Copaifera officinalis) oil over zeolite ZSM-5,
J. Hi. Res. Chromatogr., 1995, 18, 1, 54-58, https://doi.org/10.1002/jhrc.1240180112
. [all data]
Chung, Eiserich, et al., 1993
Chung, T.Y.; Eiserich, J.P.; Shibamoto, T.,
Volatile compounds isolated from edible Korean chamchwi (Aster scaber Thunb),
J. Agric. Food Chem., 1993, 41, 10, 1693-1697, https://doi.org/10.1021/jf00034a033
. [all data]
Andriamaharavo, 2014
Andriamaharavo, N.R.,
Retention Data. NIST Mass Spectrometry Data Center., NIST Mass Spectrometry Data Center, 2014. [all data]
Andrade, Sampaio, et al., 2007
Andrade, M.S.; Sampaio, T.S.; Nogueira, P.C.L.; Ribeiro, A.S.; Bittrich, V.; Amaral, M.C.E.,
Volatile compounds of the leaves, flowers and fruits of Kielmeyera rugosa Choisy (Clusiaceae),
Flavour Fragr. J., 2007, 22, 1, 49-52, https://doi.org/10.1002/ffj.1751
. [all data]
Dharmawan, Kasapis, et al., 2007
Dharmawan, J.; Kasapis, S.; Curran, P.; Johnson, J.R.,
Characterization of volatile compounds in selected citrus fruits from Asia. Part I: freshly-squeezed juice,
Flavour Fragr. J., 2007, 22, 3, 228-232, https://doi.org/10.1002/ffj.1790
. [all data]
Silva, Oliveira, et al., 2007
Silva, F.G.; Oliveira, C.B.A.; Pinto, J.E.B.P.; Nascimento, V.E.; Santos, S.C.; Seraphin, J.C.; Ferri, P.H.,
Seasonal Variability in the Essential Oils of Wild and Cultivated Baccharis trimera,
J. Braz. Chem. Soc., 2007, 18, 5, 990-997, https://doi.org/10.1590/S0103-50532007000500017
. [all data]
Cardeal, da Silva, et al., 2006
Cardeal, Z.L.; da Silva, M.D.R.G.; Marriott, P.J.,
Comprehensive two-dimensional gas chromatography/mass spectrometric analysis of pepper volatiles,
Rapid Commun. Mass Spectrom., 2006, 20, 19, 2823-2836, https://doi.org/10.1002/rcm.2665
. [all data]
Guerrini, Sacchetti, et al., 2006
Guerrini, A.; Sacchetti, G.; Muzzoli, M.; Rueda, G.M.; Medici, A.; Besco, E.; Bruni, R.,
Composition of the Volatile Fraction of Ocotea bofo Kunth (Lauraceae) Calyces by GC-MS and NMR Fingerprinting and Its Antimicrobial and Antioxidant Activity,
J. Agric. Food Chem., 2006, 54, 20, 7778-7788, https://doi.org/10.1021/jf0605493
. [all data]
Moon, Cliff, et al., 2006
Moon, S.-Y.; Cliff, M.A.; Li-Chan, E.C.Y.,
Odour-active components of simulated beef flavour analysed by solid phase microextraction and gas chromatography-mass spectrometry and -olfactometry,
Food Res. Int., 2006, 39, 3, 294-308, https://doi.org/10.1016/j.foodres.2005.08.002
. [all data]
Sacchetti, Guerrini, et al., 2006
Sacchetti, G.; Guerrini, A.; Noriega, P.; Bianchi, A.; Bruni, R.,
Essential oil of wild Ocotea quixos (Lam.) Kosterm. (Lauraceae) leaves from Amazonian Ecuador,
Flavour Fragr. J., 2006, 21, 4, 674-676, https://doi.org/10.1002/ffj.1648
. [all data]
Oliveira, Campos, et al., 2005
Oliveira, M.J.; Campos, I.F.P.; Oliveira, C.B.A.; Santos, M.R.; Souza, P.S.; Santos, S.C.; Seraphin, J.C.; Ferri, P.H.,
Influence of growth phase on the essential oil composition of Hyptis suaveolens,
Biochem. Syst. Ecol., 2005, 33, 3, 275-285, https://doi.org/10.1016/j.bse.2004.10.001
. [all data]
Sacchetti, Maietti, et al., 2005
Sacchetti, G.; Maietti, S.; Muzzoli, M.; Scaglianti, M.; Manfredini, S.; Radice, M.; Bruni, R.,
Comparative evaluation of 11 essential oils of different origin as functional antioxidants, antiradicals and antimicrobials in foods,
Food Chem., 2005, 91, 4, 621-632, https://doi.org/10.1016/j.foodchem.2004.06.031
. [all data]
Zheng, Kim, et al., 2005
Zheng, C.H.; Kim, K.H.; Kim, T.H.; Lee, H.J.,
Analysis and characterization of aroma-active compounds of Schizandra chinensis (omija) leaves,
J. Sci. Food Agric., 2005, 85, 1, 161-166, https://doi.org/10.1002/jsfa.1975
. [all data]
Sacchetti, Medici, et al., 2004
Sacchetti, G.; Medici, A.; Maietti, S.; Radice, M.; Muzzoli, M.; Manfredini, S.; Braccioli, E.; Bruni, R.,
Composition and functional properties of the essential oil of Amazonian basil, Ocimum micranthum Willd., Labiatae in comparison with commercial essential oils,
J. Agric. Food Chem., 2004, 52, 11, 3486-3491, https://doi.org/10.1021/jf035145e
. [all data]
de Kraker, Schurink, et al., 2003
de Kraker, J.-W.; Schurink, M.; Franssen, M.C.R.; König, W.A.; de Groot, A.; Bouwmeester, H.J.,
Hydroxylation of sesquiterpenes by enzymes from chicory (Cichorium intybus L.) roots,
Tetrahedron, 2003, 59, 3, 409-418, https://doi.org/10.1016/S0040-4020(02)01479-5
. [all data]
Azevedo, Campos, et al., 2002
Azevedo, N.R.; Campos, I.F.P.; Ferreira, H.D.; Portes, T.A.; Seraphin, J.C.; de Paula, J.R.; Santos, S.C.; Ferri, P.H.,
Essential oil chemotypes in Hyptis suaveolens from Brazilian Cerrado,
Biochem. Syst. Ecol., 2002, 30, 3, 205-216, https://doi.org/10.1016/S0305-1978(01)00075-8
. [all data]
Cavalli, Ranarivelo, et al., 2001
Cavalli, J.-F.; Ranarivelo, L.; Ratsimbason, M.; Bernardini, A.-F.; Casanova, J.,
Constituents of the essential oil of six Helichrysum species from Madagascar,
Flavour Fragr. J., 2001, 16, 4, 253-256, https://doi.org/10.1002/ffj.994
. [all data]
Lorenzo, Dellacassa, et al., 2001
Lorenzo, D.; Dellacassa, E.; Bonaccorsi, I.; Mondello, L.,
Uruguayan essential oils. Composition of leaf oil of Myrcianthes cisplatensis (Camb.) Berg. ('Guayabo colorado') (Myrtaceae),
Flavour Fragr. J., 2001, 16, 2, 97-99, https://doi.org/10.1002/1099-1026(200103/04)16:2<97::AID-FFJ952>3.0.CO;2-C
. [all data]
Eri, Khoo, et al., 2000
Eri, S.; Khoo, B.K.; Lech, J.; Hartman, T.G.,
Direct thermal desorption-gas chromatography and gas chromatography-mass spectrometry profiling of hop (Humulus lupulus L.) essential oils in support of varietal characterization,
J. Agric. Food Chem., 2000, 48, 4, 1140-1149, https://doi.org/10.1021/jf9911850
. [all data]
Pala-Paul, Copeland, et al., 2006
Pala-Paul, J.; Copeland, L.M.; Brophy, J.J.; Goldsack, R.J.,
Essential oil composition of two variants of Prostanthera lasianthos Labill. from Australia,
Biochem. Syst. Ecol., 2006, 34, 1, 48-55, https://doi.org/10.1016/j.bse.2005.04.003
. [all data]
Lee, Lee, et al., 2005
Lee, J.-G.; Lee, C.-G.; Kwag, J.-J.; Buglass, A.J.; Lee, G.-H.,
Determination of optimum conditions for the analysis of volatile components in pine needles by double-shot pyrolysis-gas chromatography-mass spectrometry,
J. Chromatogr. A, 2005, 1089, 1-2, 227-234, https://doi.org/10.1016/j.chroma.2005.06.060
. [all data]
Jerkovic, Mastelic, et al., 2003
Jerkovic, I.; Mastelic, J.; Milos, M.; Juteau, F.; Masotti, V.; Viano, J.,
Chemical variability of Artemisia vulgaris L. essential oils originated from the Mediterranean area of France and Croatia,
Flavour Fragr. J., 2003, 18, 5, 436-440, https://doi.org/10.1002/ffj.1246
. [all data]
Choi, Kim. M.-S.L., et al., 2002
Choi, H.-S.; Kim. M.-S.L.; Sawamura, M.,
Constituents of the essential oil of cnidium officinale Makino, a Korean medicinal plant,
Flavour Fragr. J., 2002, 17, 1, 49-53, https://doi.org/10.1002/ffj.1038
. [all data]
Brophy, Goldsack, et al., 2000
Brophy, J.J.; Goldsack, R.J.; Forster, P.I.,
Essential oils of the genus Lophostemon (Myrtaceae),
Flavour Fragr. J., 2000, 15, 1, 17-20, https://doi.org/10.1002/(SICI)1099-1026(200001/02)15:1<17::AID-FFJ859>3.0.CO;2-D
. [all data]
Brophy, Goldsack, et al., 2000, 2
Brophy, J.; Goldsack, R.J.; Bean, A.R.; Forster, P.I.; Lepschi, B.J.,
Leaf essential oils of the genus Leptospermum (Myrtaceae) in eastern Australia. Part 6. Leptospermum polygalifolium and allies,
Flavour Fragr. J., 2000, 15, 4, 271-277, https://doi.org/10.1002/1099-1026(200007/08)15:4<271::AID-FFJ910>3.0.CO;2-E
. [all data]
Brophy, Goldsack, et al., 2000, 3
Brophy, J.J.; Goldsack, R.J.; Punruckvong, A.; Bean, A.R.; Forster, P.I.; Lepschi, B.J.; Doran, J.C.; Rozefelds, A.C.,
Leaf essential oils of the genus Leptospermum (Myrtaceae) in eastern Australia. Part 7. Leptospermum petersonii, L. liversidgei and allies,
Flavour Fragr. J., 2000, 15, 5, 342-351, https://doi.org/10.1002/1099-1026(200009/10)15:5<342::AID-FFJ924>3.0.CO;2-V
. [all data]
Chagonda, Makanda, et al., 2000
Chagonda, L.S.; Makanda, C.D.; Chalchat, J.-C.,
The essential oils of Ocimum canum Sims (basilic camphor) and Ocimum urticifolia Roth from Zimbabwe,
Flavour Fragr. J., 2000, 15, 1, 23-26, https://doi.org/10.1002/(SICI)1099-1026(200001/02)15:1<23::AID-FFJ866>3.0.CO;2-W
. [all data]
Brophy, Goldsack, et al., 1999
Brophy, J.J.; Goldsack, R.J.; Punruckvong, A.; Forster, P.I.,
The leaf essential oils of Pilidiostigma (Myrtaceae),
Flavour Fragr. J., 1999, 14, 2, 143-146, https://doi.org/10.1002/(SICI)1099-1026(199903/04)14:2<143::AID-FFJ798>3.0.CO;2-P
. [all data]
Brophy, Goldsack, et al., 1999, 2
Brophy, J.J.; Goldsack, R.J.; Bean, A.R.; Forster, P.I.; Lepschi, B.J.,
Leaf essential oils of the genus Leptospermum (Myrtaceae) in eastern Australia. Part 5. Leptospermum continentale and allies,
Flavour Fragr. J., 1999, 14, 2, 98-104, https://doi.org/10.1002/(SICI)1099-1026(199903/04)14:2<98::AID-FFJ797>3.0.CO;2-V
. [all data]
Brophy, Forster, et al., 1998
Brophy, J.J.; Forster, P.I.; Goldsack, R.J.,
Esssential oils of some Australian monimiaceae,
Flavour Fragr. J., 1998, 13, 4, 273-276, https://doi.org/10.1002/(SICI)1099-1026(1998070)13:4<273::AID-FFJ745>3.0.CO;2-O
. [all data]
Brophy, Forster, et al., 1998, 2
Brophy, J.J.; Forster, P.I.; Goldsack, R.J.,
The essential oils of three unusual Eucalypts: Eucalyptus curtisii, E. rubiginosa and E. tenuipes (Myrtaceae),
Flavour Fragr. J., 1998, 13, 2, 87-89, https://doi.org/10.1002/(SICI)1099-1026(199803/04)13:2<87::AID-FFJ699>3.0.CO;2-Y
. [all data]
Brophy, Goldsack, et al., 1998
Brophy, J.J.; Goldsack, R.J.; Forster, P.I.; Bean, A.R.; Clarkson, J.R.; Lepschi, B.J.,
Leaf essential oils of the genus Leptospermum (Myrtaceae) in Eastern Australia. Part 1. Leptospermum brachyandrum and Leptospermum pallidum groups,
Flavour Fragr. J., 1998, 13, 1, 19-25, https://doi.org/10.1002/(SICI)1099-1026(199801/02)13:1<19::AID-FFJ679>3.0.CO;2-9
. [all data]
Brophy, Goldsack, et al., 1998, 2
Brophy, J.J.; Goldsack, R.J.; Bean, A.R.; Forster, P.I.; Lepschi, B.J.,
Leaf essential oils of the genus Leptospermum (Myrtaceae) in eastern Australia. Part 2. Leptospermum blakelyi and allies,
Flavour Fragr. J., 1998, 13, 5, 353-358, https://doi.org/10.1002/(SICI)1099-1026(1998090)13:5<353::AID-FFJ759>3.0.CO;2-1
. [all data]
Ollé, Baumes, et al., 1998
Ollé, D.; Baumes, R.L.; Bayonove, C.L.; Lozano, Y.F.; Sznaper, C.; Brillouet, J.-M.,
Comparison of free and glycosidically linked volatile components from polyembryonic and monoembryonic mango (Mangifera indica L.) cultivars,
J. Agric. Food Chem., 1998, 46, 3, 1094-1100, https://doi.org/10.1021/jf9705781
. [all data]
Brophy, Goldsack, et al., 1997
Brophy, J.J.; Goldsack, R.J.; Forster, P.I.,
The essential oils of the Australian species of Rhodomyrtus (Myrtaceae),
Flavour Fragr. J., 1997, 12, 2, 103-108, https://doi.org/10.1002/(SICI)1099-1026(199703)12:2<103::AID-FFJ621>3.0.CO;2-B
. [all data]
Brophy, Goldsack, et al., 1997, 2
Brophy, J.J.; Goldsack, R.J.; Forster, P.I.,
The leaf essential oils of the Australian species of Rhodamnia (Myrtaceae),
Flavour Fragr. J., 1997, 12, 5, 345-354, https://doi.org/10.1002/(SICI)1099-1026(199709/10)12:5<345::AID-FFJ658>3.0.CO;2-6
. [all data]
Hemmateenejad, Jawadnia, et al., 2007
Hemmateenejad, B.; Jawadnia, K.; Elyasi, M.,
Quantitative structure - retention relationship for the Kovats retention indices of a large set of terpenes: a comdined data splitting-feature selection strategy,
Anal. Chim. Acta, 2007, 592, 1, 72-81, https://doi.org/10.1016/j.aca.2007.04.009
. [all data]
Rodriques, Amorim, et al., 2013
Rodriques, K.A. da.F.; Amorim, L.V.; de Oliveira, J.M.G.; Dias, C.N.; Moraes, D.F.C.; Andrade, E.H. deA.; Maia, J.G.S.; Carneiro, S.M.P.; Carvalho, F.A. deA.,
Eugenia uniflora L. essential oil as a potential anti-Leishmania agent: effect on Leishmania amazonensis and possible mechanism of action,
Evidence-Based Complementary and Alternative Medicine, 2013, 2013, 1-10, https://doi.org/10.1155/2013/279726
. [all data]
Sardashti, Valizadeh, et al., 2013
Sardashti, A.R.; Valizadeh, J.; Adhami, Y.,
Variations in the essential oil composition of Peroskia abrotonolides of different growth stage in Baluchestan,
Middle-East J. Sci. Res., 2013, 13, 6, 781-784. [all data]
Bendiabdellah, El Amine Dib, et al., 2012
Bendiabdellah, A.; El Amine Dib, M.; Djabou, N.; Allali, H.; Tabti, B.; Costa, J.; Myseli, A.,
Biological activities and volatile cinstituents of Daucus muricatus L. from Algeria,
Chem. Centr. J., 2012, 6, 48, 1-22. [all data]
Boukhris, Bouaziz, et al., 2012
Boukhris, M.; Bouaziz, M.; Feki, I.; Jemai, H.; El Feki, A.; Sayadi, S.,
Hypoglycemic and antioxidant effects of leaf essential oil of Pelargonium graveolens L'Her. in alloxan induced diabetic rats,
Lipids in Health and Disease, 2012, 11, 1, 1-10, https://doi.org/10.1186/1476-511X-11-81
. [all data]
Cui, Yang, et al., 2011
Cui, J.; Yang, X.; Dong, A.-J.; Cheng, D.-Y.; Wang, J.; Zhao, H.-T.; Xu, R.-B.; Wang, P.; Li, W.-J.,
Chemical composition and antioxidant activity of Wuphorbia fischeriana essential oil from China,
J. Med. Plants Res., 2011, 5, 19, 4894-4798. [all data]
Feizbakhsh and Naeemy, 2011
Feizbakhsh, A.; Naeemy, A.,
Volatile constituents of essential oils of Eleocharis pauciflora (Light) Link and Eleocharis uniglumis (Link) J.A. Schultes growing wild in Iran,
Bull. Chem. Soc. Ethiop., 2011, 25, 3, 461-464, https://doi.org/10.4314/bcse.v25i3.68606
. [all data]
Fraternale, Ricci, et al., 2011
Fraternale, D.; Ricci, D.; Flamini, G.; Giomaro, G.,
Volatile profile of red apple from Marche region (Italy),
Rec. Nat. Prod., 2011, 5, 3, 202-207. [all data]
Hammami, Kamoun, et al., 2011
Hammami, I.; Kamoun, N.; Rebai, A.,
Biocontrol of Botrytis cinerea with essential oil and methanol extract of Viola odorata flowers,
Archives of Appl. Sci. Res., 2011, 3, 5, 44-51. [all data]
Karimi, Farmani, et al., 2011
Karimi, H.; Farmani, A.; Nourizadeh, H.,
A performance comparison of modern statistical technique for molecular descriptor selection and retention prediction of essential oil from leaves,
Amer. J. Sci. Res., 2011, 38, 36-40. [all data]
Mothana, Hasson, et al., 2011
Mothana, R.A.A.; Hasson, S.S.; Schultze, W.; Mowitz, A.; Lindequist, U.,
Phytochemical composition and in vitro antimicrobial and antioxidant activities of essential oils of three endemic Soqotraen Boswellia species,
Food Chem., 2011, 126, 3, 1149-1154, https://doi.org/10.1016/j.foodchem.2010.11.150
. [all data]
Osorio, Carriazo, et al., 2011
Osorio, C.; Carriazo, J.G.; Barbosa, H.,
Thermal and structural study of Guava (Psidium guajava L.) powders obtained by two dehydration methods,
Quim. Nova, 2011, 34, 4, 636-640, https://doi.org/10.1590/S0100-40422011000400016
. [all data]
Dib, Djabou, et al., 2010
Dib, M.ElA.; Djabou, N.; Desjobert, L.-M.; Allali, H.; Tabti, B.; Muselli, A.; Costa, J.,
Characterization of volatile compounds of Daucus crinitus Desf. headspace solid phase microextraction as alternative technique to hydrodistillation,
Chem, Centr. J., 2010, 4, 16, 1-15. [all data]
Ho, Wang, et al., 2010
Ho, C.-L.; Wang, E.I.-C.; Yu, H.-T.; Yu, H.-M.; Su, Y.-C.,
Composition amd antioxidant activities of essential oils of different tissues from Cryptomeria japonica D. Don,
Quarterly J. Chin. Forestry, 2010, 32, 1, 63-76. [all data]
Magalhaes, Lima, et al., 2010
Magalhaes, L.A.M.; Lima, M. daP.; Marques, M.O.M.; Facanali, R.; Pinto, A.C. daS.; Tadei, W.P.,
Chemical composition and larvicidal activity against Aedes aegypti Larvae of essential oils from four Guarea species,
Molecules, 2010, 15, 8, 5734-5741, https://doi.org/10.3390/molecules15085734
. [all data]
Monsef-Esfahani, Miri, et al., 2010
Monsef-Esfahani, H.R.; Miri, A.; Amini, M.; Amanzadeh, Y.; Hadjiakhoondi, A.; Hajiaghaee, R.; Ajani, Y.,
Seasonal variations in the chemical composition, antioxidant activity and total phenolic content of Teucrium persicum Boiss. essential oils,
Res. J. Biol. Sci., 2010, 5, 7, 492-498, https://doi.org/10.3923/rjbsci.2010.492.498
. [all data]
Pripdeevech, Chumpolsri, et al., 2010
Pripdeevech, P.; Chumpolsri, W.; Suttiarporn, P.; Wongpornchai, S.,
The chemical composition and antioxidant activities of Basil from Thailand using retention indices and comprehensive two-dimensional gas chromatography,
J. Seb. Chem. Soc., 2010, 75, 11, 1503-1513, https://doi.org/10.2298/JSC100203125P
. [all data]
Radulovic, Blagojevic, et al., 2010
Radulovic, N.; Blagojevic, P.; Palic, R.,
Comparative study of the leaf volatiles of Arctostaphylos uva-ursi (L.) Spreng. and Vaccinium vitis-idaea L. (Ericaceae),
Molecules, 2010, 15, 9, 6168-6185, https://doi.org/10.3390/molecules15096168
. [all data]
Radulovic, Dordevic, et al., 2010
Radulovic, N.S.; Dordevic, N.D.; Palic, R.M.,
Volatiles of Pleurospermum austriacum (L.) Hoffm. (Apiaceae),
J. Serbian Chem. Soc., 2010, 75, 12, 1-11, https://doi.org/10.2298/JSC100323127R
. [all data]
Safaei-Ghomi and Batooli, 2010
Safaei-Ghomi, J.; Batooli, H.,
Determination of bioactive molecules from flowers, leaves, stems and roots of Perovskia abrotanoides Karel growing in central Iran by nano scale injection,
Digest J. Nanomaterials Biostructures, 2010, 5, 2, 551-556. [all data]
Silva, Pott, et al., 2010
Silva, D.B.; Pott, A.; Oliveira, D.C.R.,
Analyses of the headspace volatile constituents of aerial parts (leaves and stems), flowers and fruits of Bidens gardneri Bak. and Bidens sulphurea (Cav.) Sch. Bip. using solid-phase microextraction,
J. Essen. Oil Res., 2010, 22, 6, 560-563, https://doi.org/10.1080/10412905.2010.9700400
. [all data]
de Souza, Lopes, et al., 2010
de Souza, A.; Lopes, E.M.C.; da Silva, M.C.; Cordeiro, I.; Young, M.C.M.; Sobral, M.E.G.; Moreno, P.R.H.,
Chemical composition and acetylcholinesterase inhibitory activity of essential oils of Myrceugenia myrciolides (Cambess.) O. Berg and Eugenia riedelliana O. Berg, Myrtaceae,
Braz. J. Pharmacognosy, 2010, 20, 2, 175-179. [all data]
Xu, Tang, et al., 2010
Xu, X.; Tang, Z.; Liang, Y.,
Comparative analysis of plant essential oils by GC-MS coupled with integrated chemometric resolution methods,
Anal. Methods, 2010, 2, 4, 359-367, https://doi.org/10.1039/b9ay00213h
. [all data]
Dayisoylu and Alma, 2009
Dayisoylu, K.S.; Alma, M.H.,
Chemical analysis of essential oils from cone's rosin of Cilician fir (Abies cilicica subsp. cilicica),
Afr. J. Biotechnol., 2009, 8, 15, 3502-3505. [all data]
Gauvin-Bialecki and Marodon, 2009
Gauvin-Bialecki, A.; Marodon, C.,
Essential oil of Ayapana triplinervis from Reunion island: a good natural source of thymohydroquinone dimethyl ether,
Biochem. Systematics Ecol., 2009, 36, 11, 853-858, https://doi.org/10.1016/j.bse.2008.09.006
. [all data]
Hnawia, Menut, et al., 2009
Hnawia, E.; Menut, C.; Agrebi, A.; Cabalion, P.,
Wood essential oil of two endemic trees from New Caledonia: Callitris sulcata (Parl.) Schltr. and Callitris neocaledonica Dummer,
Biochem. Systematics Ecol., 2009, 36, 11, 859-866, https://doi.org/10.1016/j.bse.2008.08.007
. [all data]
Ho, Wang, et al., 2009
Ho, C.-L.; Wang, E.I.-C.; Su, Y.-C.,
Essential oil compositions and bioactivities of the various parts of Cinnamomum camphora Sieb. var. linallolifera Fujuta,
Journal title only in Chinese, 2009, 31, 2, 77-96. [all data]
Kazemi and Akhavani, 2009
Kazemi, M.; Akhavani, S.,
Constituents of Artemisia tournefortiana Rchb. essential oil from Iran,
J. Appl. Chem. Res., 2009, 3, 10, 1-5. [all data]
Kim and Chung, 2009
Kim, J.-S.; Chung, H.Y.,
GC-MS analysis of the volatile components in dried boxthorn (Lycium chimensis) Fruit,
J. Korean Soc. Appl. Biol. Chem., 2009, 52, 5, 516-524, https://doi.org/10.3839/jksabc.2009.088
. [all data]
Lago, Favero, et al., 2009
Lago, J.H.G.; Favero, O.A.; Romoff, P.,
Chemical composition and seasonal variations of the volatile oils from leaves of Michelia champaca L., Magnoliaceae,
Braz. J. Pharmacognosia, 2009, 19, 4, 880-882. [all data]
Lawal and Oyedelji, 2009
Lawal, O.A.; Oyedelji, A.O.,
Chemical composition of the essential oils of Cyperus rotundus L. from South Africa,
Molecules, 2009, 14, 8, 2909-2917, https://doi.org/10.3390/molecules14082909
. [all data]
Marchesini, Prada, et al., 2009
Marchesini, A.M.; Prada, G.G.; Messiano, G.B.; Machado, M.B.; Lopes, L.M.X.,
Chemical constituents of Aristolochia giberti,
J. Braz. Chem. Soc., 2009, 20, 9, 1598-1608, https://doi.org/10.1590/S0103-50532009000900006
. [all data]
Museli, Pau, et al., 2009
Museli, A.; Pau, M.; Desjobert, J.-M.; Foddai, M.; Usai, M.; Costa, J.,
Volatile constituents of Achllea ligustica All. by HS-SPME/GC/GC-MS. Comparison with essential oils obtained by hydrodistillation from Corsica and Sardinia,
Chromatographia, 2009, 69, 5/6, 575-585, https://doi.org/10.1365/s10337-008-0939-1
. [all data]
Scrivanti, Anton, et al., 2009
Scrivanti, L.R.; Anton, A.M.; Zygadlo, J.A.,
Essential oil conposition of Bothriochloa Kuntze (Poaceae) from South America and their chemotaxonomy,
Biochem. Systematics Ecol., 2009, 37, 3, 206-213, https://doi.org/10.1016/j.bse.2009.03.009
. [all data]
Shafaghat and Sadeghi, 2009
Shafaghat, A.; Sadeghi, H.,
Composition and antibacterial activity of essentia; oils from leaf, stem and root of Chrysanthemum parthenium (L.) Bernh. from Iran,
Electronic J. of Environ., Agriculture and Food Chem. (EJEAFChe), 2009, 8, 9, 766-771. [all data]
Shimizu, Imayoshi, et al., 2009
Shimizu, Y.; Imayoshi, Y.; Kato, M.; Maeda, K.; Iwabuchi, H.; Shimomura, K.,
Volatiles from leaves of field-grown plants and shoot cultures of Gynura bicolor DC,
Flavour Fragr. J., 2009, 24, 5, 251-258, https://doi.org/10.1002/ffj.1938
. [all data]
de Souza, Lopes, et al., 2009
de Souza, A.; Lopes, E.M.C.; da Silva, M.C.; Cordeiro, I.; Young, M.C.M.; Sobral, M.E.G.; Moreno, P.R.H.,
Chemical composition and acetylcholinesterase inhibitory activity of essential oils of Myrceugenia myrcioides (Chambess.) O. Berg and Eugenia riedeliana O. Berg, Myrtaceae,
Braz. J. Pharmacognosy, 2009, 20, 2, 175-179. [all data]
Zhao, Zeng, et al., 2009
Zhao, C.; Zeng, Y.; Wan, M.; Li, R.; Liang, Y.; Li, C.; Zeng, Z.; Chau, F.-T.,
Comparative analysis of essential oils from eight herbal medicines with pungent flavor and cool nature by GC-MS and chemometric resolution methods,
J. Sep. Sci., 2009, 32, 4, 660-670, https://doi.org/10.1002/jssc.200800484
. [all data]
Aicha, Ines, et al., 2008
Aicha, N.; Ines, S.; Mohamed, B.S.; Ines, B.; Soumaya, K.; Kamel, G.; Mohamed, N.; Imed, C.; Mohamed, H.; Leila, C.-G.,
Chemical composition, mutagenic and antimutagenic activities of essential oils from (Tunisian) Artemisia campestris and Artemisia herba-alba,
J. Ess. Oil Res., 2008, 20, 5, 471-477. [all data]
Bouwmeester, de Kraker, et al., 2008
Bouwmeester, H.J.; de Kraker, J.-W.; Schurink, M.; Bino, R.J.; de Groot, A.,
Plant Enzymes for Bioconversion, 2008, 57. [all data]
Khokra, Prakash, et al., 2008
Khokra, S.L.; Prakash, O.; Jain, S.; Aneja, K.R.; Dhingra, Y.,
Essential oil composition and antibacterial studies of Vitex negundo Linn. extracts,
Indian J. Pharm. Sci., 2008, 70, 4, 522-526, https://doi.org/10.4103/0250-474X.44610
. [all data]
Noudogbessi, Yedomonhan, et al., 2008
Noudogbessi, J.-P.; Yedomonhan, P.; Sohounhloue, D.C.K.; Chalchat, J.-C.; Figueredo, G.,
Chemical composition of essential oil of syzygium guineense (Willd.) DC. var. guineense (Myrtaceae) from Benin,
Rec. Nat. Prod., 2008, 33-38. [all data]
Raj, Baby, et al., 2008
Raj, G.; Baby, S.; Dan, M.; Thaha, A.R.M.; Sethuraman, M.G.; George, V.,
Volatile constituents from the rhisomes of Curcuma haritha Mangaly and Sabu from Sauthern India,
Flavour Fragr. J., 2008, 23, 5, 348-352, https://doi.org/10.1002/ffj.1891
. [all data]
Yassa and Akhani, 2008
Yassa, N.; Akhani, H.,
The essential oils composition in two species of the genus Eriocycla Lindl. (Apiaceae) from Iran, 2008, retrieved from http://biology.ut.ac.ir/members/akhani/PdfReprintNumber/27.pdf. [all data]
Adams, Beauchamp, et al., 2007
Adams, R.P.; Beauchamp, P.S.; Dev, V.; Dutz, S.M.,
New Natural Products Isolated from One-Seeded Juniperus of the Southwestern United States: Isolation and Occurence of 2-Ethenyl-3-methyl Phanol and Its Derivatives,
J. Essent. Oil Res., 2007, 19, 2, 146-152, https://doi.org/10.1080/10412905.2007.9699247
. [all data]
Amiri, 2007
Amiri, H.,
Quantative and qualative changes of essential oil of Salvia bracteata BAnk et Sol. in different growth stages,
DARU, 2007, 15, 2, 79-82. [all data]
Baran, von Reuss, et al., 2007
Baran, S.; von Reuss, S.H.; König, W.A.; Kalemba, D.,
Composition of the essential oil of Abies koreana Wils.,
Flavour Fragr. J., 2007, 22, 1, 78-83, https://doi.org/10.1002/ffj.1762
. [all data]
Capetanos, Saroglou, et al., 2007
Capetanos, C.; Saroglou, V.; Marin, P.D.; Simic, A.; Skaltsa, H.D.,
Essential oil snalysis of two endemic Eringium species from Serbia,
J. Serb. Chem. Soc., 2007, 72, 10, 961-965, https://doi.org/10.2298/JSC0710961C
. [all data]
Da Silva J.K.R., Sousa P.J.C., et al., 2007
Da Silva J.K.R.; Sousa P.J.C.; Andrade E.H.A.; Maia JGS,
Antioxidant capacity and cytotoxicity of essential oil and methanol extract of Aniba canellia (HBK) Mez,
J. Agric. Food Chem., 2007, 55, 23, 9422-9426, https://doi.org/10.1021/jf071928e
. [all data]
Farsam, Amanlou, et al., 2007
Farsam, H.; Amanlou, M.; Taghi-Cheetsaz, N.; Amin, G.R.; Saledi-Sormaghi, M.H.,
Essential Oil of Chimonanthus fragrans flowers Population of Tehran,
DARU, 2007, 15, 3, 129-131. [all data]
Hachicha, Skanji, et al., 2007
Hachicha, S.F.; Skanji, T.; Barrek, S.; Ghrabi, Z.G.; Zarrouk, H.,
Composition of the essential oil of Teucrium ramosissimum Desf. (Lamiaceae) from Tunisia,
Flavour Fragr. J., 2007, 22, 2, 101-104, https://doi.org/10.1002/ffj.1764
. [all data]
Jerkovic, Mastelic, et al., 2007
Jerkovic, I.; Mastelic, J.; Marijanovic, Z.,
Bound volatile compounds and essential oil from the fruit of Maclura pomifera (Raf.) Schneid. (osage orange),
Flavour Fragr. J., 2007, 22, 1, 84-88, https://doi.org/10.1002/ffj.1763
. [all data]
Loizzo, Tundis, et al., 2007
Loizzo, M.R.; Tundis, R.; Conforti, F.; Saab, A.M.; Statti, G.A.; Menichini, F.,
Comparative chemical composition, antioxidant and hypoglycaemic activities of Juniperus oxycedrus ssp. oxycedrus L. berry and wood oils from Lebanon,
Food Chem., 2007, 105, 2, 572-578, https://doi.org/10.1016/j.foodchem.2007.04.015
. [all data]
Mohottalage, Tabacchi, et al., 2007
Mohottalage, S.; Tabacchi, R.; Guerin, P.M.,
Components from Sri Lankan Piper betle L. leaf oil and their analogues showing toxicity against the housefly, Musca domestica,
Flavour Fragr. J., 2007, 22, 2, 130-138, https://doi.org/10.1002/ffj.1770
. [all data]
Moreno, Lima, et al., 2007
Moreno, P.R.H.; Lima, M.E.L.; Sobral, M.; Young, M.C.M.; Cordeiro, I.; Apel, M.A.A.; Limberger, R.P.; Henriques, A.T.,
Essential oil composition of fruit colour varieties of Eugenia brasiliensis Lam.,
Sci. Agr.; (Piracicaba Praz.), 2007, 64, 4, 428-432. [all data]
Morteza-Semnani, Saeedi, et al., 2007
Morteza-Semnani, K.; Saeedi, M.; Akbarzadeh, M.,
Essential oil composition of Teucrium scordium L.,
Acta Pharm., 2007, 57, 4, 499-504, https://doi.org/10.2478/v10007-007-0040-6
. [all data]
Oliveira, Leitão, et al., 2007
Oliveira, D.R.; Leitão, G.G.; Bizzo, H.R.; Lopes, D.; Alviano, D.S.; Alviano, C.S.; Leitão, S.G.,
Chemical and antimicrobial analyses of essential oil of Lippia origanoides H.B.K,
Food Chem., 2007, 101, 1, 236-240, https://doi.org/10.1016/j.foodchem.2006.01.022
. [all data]
Ouattara, Koudou, et al., 2007
Ouattara, L.; Koudou, J.; Obame, L.C.E.; Karou, D.S.; Traore, A.; Bessiere, J.M.,
Chemical composition and antibacterial activity of Cochlospermum planchoni Hook. f. ex Planch essential oil from Burkina Faso,
Pakistan J. Biol. Sci., 2007, 10, 22, 4177-4179, https://doi.org/10.3923/pjbs.2007.4177.4179
. [all data]
Ozcan and Chalchat, 2007
Ozcan, M.M.; Chalchat, J.C.,
Chemical Composition od Carrot Seeds (Daucus carota L.) Cultivated in Turkey: Characterization of the Seed Oil and Essential Oil,
Grasas y Aceites, 2007, 58, 4, 359-365. [all data]
Pala-Paul, Brophy, et al., 2007
Pala-Paul, J.; Brophy, J.J.; Perez-Alonso, M.J.; Usano, J.; Soria, S.C.,
Essential oil composition of the different parts of Eryngium corniculatum Lam. (Apiaceae) from Spain,
J. Chromatogr. A, 2007, 1175, 2, 289-293, https://doi.org/10.1016/j.chroma.2007.10.061
. [all data]
Phutdhawong, Kawaree, et al., 2007
Phutdhawong, W.; Kawaree, R.; Sanjaia, S.; Sengpracha, W.; Buddhasukh, D.,
Microwave-Assisted Isolation of Essential Oil of Cinnamomum iners Reinw. es Bl.: Comparison with Conventional Hydrodistillation,
Molecules, 2007, 12, 4, 868-877, https://doi.org/10.3390/12040868
. [all data]
Pinto, Salgueiro, et al., 2007
Pinto, E.; Salgueiro, L.R.; Cavaleiro, C.; Palmeira, A.; Goncalves, M.J.,
In vitro susceptibility of some species of yeasts and filamentous fungi to essential oils of Salvia of?cinalis,
Ind. Crops Prod., 2007, 26, 2, 135-141, https://doi.org/10.1016/j.indcrop.2007.02.004
. [all data]
Rojas, Velasco, et al., 2007
Rojas, J.; Velasco, J.; Rojas, L.B.; Carmona, J.; Morales, A.,
Chemical composition and antimicrobial activity of the essential oil of Baacharis latifolia Pers. and B. prunifolia H.B.K. (Asteraceae),
Natural Product Communications, 2007, 2, 12, 1245-1248. [all data]
Yassa and Akhani, 2007
Yassa, N.; Akhani, H.,
The essential oils composition in two species of the genus Eriocycla Lindl. (Apiaceae) from Iran, 2007, retrieved from http://biology.ut.ac.ir/members/akhani/PdfReprintNumber/27.pdf. [all data]
Abdelwahed, Hayder, et al., 2006
Abdelwahed, A.; Hayder, N.; Kilani, S.; Mahmoud, A.; Chibani, J.; Hammami, M.; Chekir-Ghedira, L.; Ghedira, K.,
Chemical composition and antimicrobial activity of essential oils from Tunisian Pituranthos tortuosus (Coss.) Maire,
Flavour Fragr. J., 2006, 21, 1, 129-133, https://doi.org/10.1002/ffj.1542
. [all data]
Apel, Sobral, et al., 2006
Apel, M.A.; Sobral, M.; Zuanazzi, J.A.S.; Henriques, A.T.,
Essential oil composition of four Plinia species (Myrtaceae),
Flavour Fragr. J., 2006, 21, 3, 565-567, https://doi.org/10.1002/ffj.1638
. [all data]
Borges, Rojas, et al., 2006
Borges, R.; Rojas, L.B.; Cegarra, J.A.; Usubillaga, A.,
Study of the essential oils from the leaves and flowers of Lepechinia conferta (Benth) Epl.,
Flavour Fragr. J., 2006, 21, 1, 155-157, https://doi.org/10.1002/ffj.1550
. [all data]
Boti, Muselli, et al., 2006
Boti, J.B.; Muselli, A.; Tomi, F.; Koukoua, G.; N'Guessan, T.Y.; Costa, J.; Casanova, J.,
Combined analysis of Cymbopogon giganteus Chiov. leaf oil from Ivory Coast by GC/RI, GC/MS and 13C-NMR,
C.R. Chim., 2006, 9, 1, 164-168, https://doi.org/10.1016/j.crci.2005.10.003
. [all data]
Boti, Yao, et al., 2006
Boti, J.B.; Yao, P.A.; Koukoua, G.; N'Guessan, T.Y.; Casanova, J.,
Components and chemical variability of Isolona campanulata Engler Diels leaf oil,
Flavour Fragr. J., 2006, 21, 1, 166-170, https://doi.org/10.1002/ffj.1555
. [all data]
Bozin, Mimicá-Dukic, et al., 2006
Bozin, B.; Mimicá-Dukic, N.; Simin, N.; Anackov, G.,
Characterization of the volatile composition of essential oils of some lamiaceae spices and the antimicrobial and antioxidant activities of the entire oils,
J. Agric. Food Chem., 2006, 54, 5, 1822-1828, https://doi.org/10.1021/jf051922u
. [all data]
Castel, Fernandez, et al., 2006
Castel, C.; Fernandez, X.; Lizzani-Cuvelier, L.; Perichet, C.; Lavoine, S.,
Characterization of the Chemical Composition of a Byproduct from Siam Benzoin Gum,
J. Agric. Food Chem., 2006, 54, 23, 8848-8854, https://doi.org/10.1021/jf061193y
. [all data]
Chen, Sheu, et al., 2006
Chen, H.-C.; Sheu, M.-J.; Wu, C.-M.,
Characterization of Volatiles in Guava (Psidium guajava L. cv. Chung-Shan-Yueh-Pa) Fruit from Taiwan,
J. Food Drug. Anal., 2006, 14, 4, 398-402. [all data]
Damjanovic, Skala, et al., 2006
Damjanovic, B.; Skala, D.; Baras, J.; Petrovic-Djakov, D.,
Isolation of essential oil and supercritical carbon dioxide extract of Juniperus communis L. fruits from Montenegro,
Flavour Fragr. J., 2006, 21, 6, 875-880, https://doi.org/10.1002/ffj.1711
. [all data]
Fernandez, Pintaric, et al., 2006
Fernandez, X.; Pintaric, C.; Lizzani-Cuvelier, L.; Loiseau, A.-M.; Morello, A.; Pellerin, P.,
Chemical composition of absolute and supercritical carbon dioxide extract of Aframomum melegueta,
Flavour Fragr. J., 2006, 21, 1, 162-165, https://doi.org/10.1002/ffj.1554
. [all data]
Gohari, Hadjiakhoondi, et al., 2006
Gohari, A.R.; Hadjiakhoondi, A.; Sadat-Ebrahimi, E.; Saeidnia, S.; Shafiee, A.,
Composition of the volatile oils of Satureja spicigera C. Koch Boiss. and S. macrantha C. A. Mey from Iran,
Flavour Fragr. J., 2006, 21, 2, 348-350, https://doi.org/10.1002/ffj.1642
. [all data]
Gohari A.R., Hadjiakhoondi A., et al., 2006
Gohari A.R.; Hadjiakhoondi A.; Sadat-Ebrahimi E.; Saeidnia S.; Shafiee A.,
Composition of the volatile oils of Satureja spicigera C. Koch Boiss. and S-macrantha C. A. Mey from Iran,
Flavour Fragr. J., 2006, 21, 3, 510-512, https://doi.org/10.1002/ffj.1613
. [all data]
Hymete, Rohloff, et al., 2006
Hymete, A.; Rohloff, J.; Iversen, T.-H.,
Essential oil from seeds and husks of Aframomum corrorima from Ethiopia,
Flavour Fragr. J., 2006, 21, 4, 642-644, https://doi.org/10.1002/ffj.1634
. [all data]
Ibañez and Usubillaga, 2006
Ibañez, J.; Usubillaga, A.,
The essential oil of Espeletia schultzii of different altitudinal populations,
Flavour Fragr. J., 2006, 21, 2, 286-289, https://doi.org/10.1002/ffj.1586
. [all data]
Ibanez and Usubillaga, 2006
Ibanez, J.; Usubillaga, A.,
Analysis of the essential oil of two different altitudinal populations of Coespeletia moritziana (Sch. Bip.ex Wedd) Cuatrec,
Flavour Fragr. J., 2006, 21, 5, 760-763, https://doi.org/10.1002/ffj.1655
. [all data]
Kula, Izydorczyk, et al., 2006
Kula, J.; Izydorczyk, K.; Czajkowska, A.; Bonikowski, R.,
Chemical composition of carrot umbel oils from Daucus carota L. ssp. sativus cultivated in Poland,
Flavour Fragr. J., 2006, 21, 4, 667-669, https://doi.org/10.1002/ffj.1646
. [all data]
Lesueur, Ban, et al., 2006
Lesueur, D.; Ban, N.K.; Bighelli, A.; Muselli, A.; Casanova, J.,
Analysis of the root oil of Fokienia hodginsii (Dunn) Henry et Thomas (Cupressaceae) by GC, GC-MS and 13C-NMR,
Flavour Fragr. J., 2006, 21, 1, 171-174, https://doi.org/10.1002/ffj.1557
. [all data]
Martin, Joseph, et al., 2006
Martin, M.A.C.K.; Joseph, H.; Bercion, S.; Menut, C.,
Chemical composition of essential oils from aerial parts of Aframomum exscapum (Sims) Hepper collected in Guadeloupe, French West Indies,
Flavour Fragr. J., 2006, 21, 6, 902-905, https://doi.org/10.1002/ffj.1741
. [all data]
Miyazawa and Kawata, 2006
Miyazawa, M.; Kawata, J.,
Identification of the Key Aroma Compounds in Dried Roots of Rubia cordifolia,
L. Oleo Sci., 2006, 55, 1, 37-39, https://doi.org/10.5650/jos.55.37
. [all data]
Moody, Gundidza, et al., 2006
Moody, J.O.; Gundidza, M.; Wyllie, G.,
Essential oil composition of Leucas milanjiana Guerke,
Flavour Fragr. J., 2006, 21, 6, 872-874, https://doi.org/10.1002/ffj.1669
. [all data]
Morteza-Semnani, Akbarzadeh, et al., 2006
Morteza-Semnani, K.; Akbarzadeh, M.; Changizi, S.,
Essential oils composition of Stachys byzantina, S. inflata, S. lavandulifolia and S. laxa from Iran,
Flavour Fragr. J., 2006, 21, 2, 300-303, https://doi.org/10.1002/ffj.1594
. [all data]
Morteza-Semnani K., Akbarzadeh M., et al., 2006
Morteza-Semnani K.; Akbarzadeh M.; Moshiri K.,
The essential oil composition of Eupatorium cannabinum L. from Iran,
Flavour Fragr. J., 2006, 21, 3, 521-523, https://doi.org/10.1002/ffj.1687
. [all data]
Potzernheim, Bizzo, et al., 2006
Potzernheim, M.C.L.; Bizzo, H.R.; Vieira, R.F.,
Analysis of the essential oil of three species of Piper collected in the region of the Distrito Federal (Cerrado - Brazilian Savannah) and comparison with oils of plants from region of Paraty, State of Rio de Janeiro (Atlantic Rain Forest),
Brazilian Journal of Pharmacognosy, 2006, 16, 2, 246-251. [all data]
Senatore, Landolfi, et al., 2006
Senatore, F.; Landolfi, S.; Celik, S.; Bruno, M.,
Volatile components of Centaurea calcitrapa L. and Centaurea sphaerocephala L. ssp. sphaerocephala, two Asteraceae growing wild in Sicily,
Flavour Fragr. J., 2006, 21, 2, 282-285, https://doi.org/10.1002/ffj.1585
. [all data]
Shafi, Jose, et al., 2006
Shafi, P.M.; Jose, B.; Radhamani, K.T.; Clery, R.A.,
Influence of pH on essential oil composition of Zanthoxylum rhetsa seeds obtained by steam distillation,
Flavour Fragr. J., 2006, 21, 2, 317-318, https://doi.org/10.1002/ffj.1598
. [all data]
Tesso, König, et al., 2006
Tesso, H.; König, W.A.; Son, P.T.; Giang, P.M.,
Composition of the essential oil of flowers of Chloranthus spicatus (Thunb.) Makino,
Flavour Fragr. J., 2006, 21, 4, 592-597, https://doi.org/10.1002/ffj.1528
. [all data]
Trilles, Bombarda, et al., 2006
Trilles, B.L.; Bombarda, I.; Bouraïma-Madjebi, S.; Raharivelomanana, P.; Bianchini, J.-P.; Gaydou, E.M.,
Occurrence of various chemotypes in niaouli [Melaleuca quinquenervia (Cav.) S. T. Blake] essential oil from New Caledonia,
Flavour Fragr. J., 2006, 21, 4, 677-682, https://doi.org/10.1002/ffj.1649
. [all data]
Wong, Lim, et al., 2006
Wong, K.C.; Lim, T.B.; Ali, D.M.H.,
Essential oil of Homalomena sagittifolia Jungh.,
Flavour Fragr. J., 2006, 21, 5, 786-788, https://doi.org/10.1002/ffj.1714
. [all data]
Wong, Sivasothy, et al., 2006
Wong, K.C.; Sivasothy, Y.; Boey, P.L.,
Essential oil of Elettariopsis elan C.K. Lim,
Flavour Fragr. J., 2006, 21, 3, 562-564, https://doi.org/10.1002/ffj.1654
. [all data]
Asadipour, Mehrabani, et al., 2005
Asadipour, A.; Mehrabani, M.; Najafi, M.L.,
Volatile oil composition of Centaurea aucheri (DC.) wagenitz,
DARU, 2005, 13, 3, 160-164. [all data]
Chagonda and Chalchat, 2005
Chagonda, L.S.; Chalchat, J.-C.,
The essential oil of wild and cultivated Hoslundia opposita Vahl. from Zimbabwe,
Flavour Fragr. J., 2005, 20, 2, 193-195, https://doi.org/10.1002/ffj.1402
. [all data]
Chagonda and Chalchat, 2005, 2
Chagonda, L.S.; Chalchat, J.-C.,
The essential oil of the fruit of Garcinia huillensis Welw. ex. Oliv. from Zimbabwe,
Flavour Fragr. J., 2005, 20, 3, 313-315, https://doi.org/10.1002/ffj.1420
. [all data]
Chaverri and Cicció, 2005
Chaverri, C.; Cicció, J.F.,
Essential oil of trees of the genus Ocotea (Lauraceae) in Costa Rica. I. Ocotea brenesii,
Rev. Biol. Trop., 2005, 53, 3-4, 431-436, https://doi.org/10.15517/rbt.v53i3-4.14611
. [all data]
Cornu, Kondjoyan, et al., 2005
Cornu, A.; Kondjoyan, N.; Martin, B.; Verdier-Metz, I.; Pradel, P.; Berdague, J.-L.; Coulon, J.-B.,
Terpene profiles in Cantal and Saint-Nectairetype cheese made from raw or pasteurised milk,
J. Sci. Food Agric., 2005, 85, 12, 2040-2046, https://doi.org/10.1002/jsfa.2214
. [all data]
Facundo, Pinto, et al., 2005
Facundo, V.A.; Pinto, A.C.; Rezende, C.M.,
Aroma compounds and volatile chemical composition of Ruellia menthoides (Nees) Hiern,
Flavour Fragr. J., 2005, 20, 1, 93-95, https://doi.org/10.1002/ffj.1380
. [all data]
Fakhari A.R., Sonboli A., et al., 2005
Fakhari A.R.; Sonboli A.; Heydari R.,
Composition of the essential oil of Rhabdosciadium strausii from Iran,
Chem. Nat. Compd. (Engl. Transl.), 2005, 41, 4, 413-414, https://doi.org/10.1007/s10600-005-0164-1
. [all data]
Ferraz, Limberger, et al., 2005
Ferraz, A.B.F.; Limberger, R.P.; Bordignon, S.A.L.; von Poser, G.L.; Henriques, A.T.,
Essential oil composition of six Hypericum species from southern Brazil,
Flavour Fragr. J., 2005, 20, 3, 335-339, https://doi.org/10.1002/ffj.1435
. [all data]
Gauvin and Smadja, 2005
Gauvin, A.; Smadja, J.,
Essential oil composition of four Psiadia species from Reunion Island: A chemotaxonomic study,
Biochem. Syst. Ecol., 2005, 33, 7, 705-714, https://doi.org/10.1016/j.bse.2004.12.013
. [all data]
Ghasemi Y., Faridi P., et al., 2005
Ghasemi Y.; Faridi P.; Mehregan I.; Mohagheghzadeh A.,
Ferula gummosa fruits: An aromatic antimicrobial agent,
Chem. Nat. Compd. (Engl. Transl.), 2005, 41, 3, 311-314, https://doi.org/10.1007/s10600-005-0138-3
. [all data]
Morteza-Semnani and Saeedi, 2005
Morteza-Semnani, K.; Saeedi, M.,
The essential oil composition of Hypericum androsaemum L. leaves and flowers from Iran,
Flavour Fragr. J., 2005, 20, 3, 332-334, https://doi.org/10.1002/ffj.1432
. [all data]
Morteza-Semnani and Saeedi, 2005, 2
Morteza-Semnani, K.; Saeedi, M.,
The essential oil composition of Phlomis bruguieri Desf. from Iran,
Flavour Fragr. J., 2005, 20, 3, 344-346, https://doi.org/10.1002/ffj.1459
. [all data]
Oyedeji, Yani, et al., 2005
Oyedeji, O.A.; Yani, V.V.; Afolayan, A.J.,
Chemical composition of the essential oil from Arctotis arctotoides (L.F.) O. Hoffm. (syn. Vendium arctotoides Less.),
Flavour Fragr. J., 2005, 20, 2, 232-234, https://doi.org/10.1002/ffj.1437
. [all data]
Palá-Paúl, Pérez-Alonso, et al., 2005
Palá-Paúl, J.; Pérez-Alonso, M.; Velasco-Negueruela, A.; Vadaré, J.; Villa, A.M.; Sanz, J.; Brophy, J.J.,
Analysis of the essential oil composition from the different parts of Eryngium glaciale Boiss. from Spain,
J. Chromatogr. A, 2005, 1094, 1-2, 179-182, https://doi.org/10.1016/j.chroma.2005.09.029
. [all data]
Petrakis, Roussis, et al., 2005
Petrakis, P.V.; Roussis, V.; Papadimitriou, D.; Vagias, C.; Tsitsimpikou, C.,
The effect of terpenoid extracts from 15 pine species on the feeding behavioural sequence of the late instars of the pine processionary caterpillar Thaumetopoea pityocampa,
Behav. Processes, 2005, 69, 3, 303-322, https://doi.org/10.1016/j.beproc.2004.12.008
. [all data]
Pourmortazavi, Ghadiri, et al., 2005
Pourmortazavi, S.M.; Ghadiri, M.; Hajimirsadeghi, S.S.,
Supercritical fluid extraction of volatile components from Bunium persicum Boiss. (black cumin) and Mespilus germanica L. (medlar) seeds,
J. Food Comp. Anal., 2005, 18, 5, 439-446, https://doi.org/10.1016/j.jfca.2004.01.003
. [all data]
Sajjadi and Ghannadi, 2005
Sajjadi, S.-E.; Ghannadi, A.,
Essential oil of the Persian sage, Salvia rhytidea Benth.,
Acta Pharm. Sin., 2005, 55, 321-326. [all data]
Sarkhail, Amin, et al., 2005
Sarkhail, P.; Amin, G.; Surmaghi, M.H.S.; Shafiee, A.,
Composition of the volatile oils of Phlomis lanceolata Boiss. Hohen., Phlomis anisodonta Boiss. and Phlomis bruguieri Desf. from Iran,
Flavour Fragr. J., 2005, 20, 3, 327-329, https://doi.org/10.1002/ffj.1427
. [all data]
Sefidkon and Jamzad, 2005
Sefidkon, F.; Jamzad, Z.,
Chemical composition of the essential oil of three Iranian Satureja species (S. mutica, S. macrantha and S. intermedia),
Food Chem., 2005, 91, 1, 1-4, https://doi.org/10.1016/j.foodchem.2004.01.027
. [all data]
Senatore, Apostolides Arnold, et al., 2005
Senatore, F.; Apostolides Arnold, N.; Bruno, M.,
Volatile components of Centaurea eryngioides Lam. and Centaurea liberica Trev. var. hermonis Boiss. Lam., two Asteraceae growing wild in Lebanon,
Nat. Prod. Res., 2005, 19, 8, 749-754, https://doi.org/10.1080/14786410412331302136
. [all data]
Setzer, Noletto, et al., 2005
Setzer, W.N.; Noletto, J.A.; Lawton, R.O.; Haber, W.A.,
Leaf essential oil composition of five Zanthoxylum species from Monteverde, Costa Rica,
Molecular Diversity, 2005, 9, 1-3, 3-13, https://doi.org/10.1007/s11030-005-1298-6
. [all data]
Simoes-Pires C.A., Debenedetti S., et al., 2005
Simoes-Pires C.A.; Debenedetti S.; Spegazzini E.; Mentz L.A.; Matzenbacher N.I.; Limberger R.P.; Henriques A.T.,
Investigation of the essential oil from eight species of Baccharis belonging to sect. Caulopterae (Asteraceae, Astereae): a taxonomic approach,
Plant Systematics and Evolution, 2005, 253, 1-4, 23-32, https://doi.org/10.1007/s00606-005-0296-6
. [all data]
Sonboli, Salehi, et al., 2005
Sonboli, A.; Salehi, P.; Ebrahimi, S.N.,
Essential oil composition and antibacterial activity of the leaves of Stachys schtschegleevii from Iran,
Chem. Nat. Compd. (Engl. Transl.), 2005, 41, 2, 171-175, https://doi.org/10.1007/s10600-005-0105-z
. [all data]
Tzakou and Constantinidis, 2005
Tzakou, O.; Constantinidis, T.,
Chemotaxonomic significance of volatile compounds in Thymus samius and its related species Thymus atticus and Thymus parnassicus,
Biochem. Syst. Ecol., 2005, 33, 11, 1131-1140, https://doi.org/10.1016/j.bse.2005.03.008
. [all data]
Utsunomia, Kawata, et al., 2005
Utsunomia, H.; Kawata, J.; Chanoki, W.; Shirakawa, N.; Miyazawa, M.,
Components of Essential Oil from Woods of Prunus mume Sieb. at Zucc.,
J. Oleo Sci., 2005, 54, 11, 609-612, https://doi.org/10.5650/jos.54.609
. [all data]
Watanabe Y., Mihara R., et al., 2005
Watanabe Y.; Mihara R.; Mitsunaga T.; Yoshimura T.,
Termite repellent sesquiterpenoids from Callitris glaucophylla heartwood,
J. Wood Sci., 2005, 51, 5, 514-519, https://doi.org/10.1007/s10086-004-0683-6
. [all data]
Blanc, Muselli, et al., 2004
Blanc, M.-C.; Muselli, A.; Bradesi, P.; Casanova, J.,
Chemical composition and variability of the essential oil of Inula graveolens from Corsica,
Flavour Fragr. J., 2004, 19, 4, 314-319, https://doi.org/10.1002/ffj.1304
. [all data]
Fekam Boyom, Fotio, et al., 2004
Fekam Boyom, F.; Fotio, D.; Amvam Zollo, P.H.; Agnaniet, H.; Menut, C.; Bessière, J.M.,
Aromatic plants of tropical Central Africa. Part XLIV. Volatile components from Pseudocedrela kotschyi (Schweinf.) harms growing in Cameroon,
Flavour Fragr. J., 2004, 19, 1, 9-11, https://doi.org/10.1002/ffj.1254
. [all data]
bin Jantan, Ayop, et al., 2004
bin Jantan, I.; Ayop, N.; Mohd Ali, N.A.; Ahmad, A.S.; Yalvema, M.F.; Muhammad, K.; Azizi, A.R.,
The essential oils of Cinnamomum rhyncophyllum Miq. as natural sources of benzyl benzoate, safrole and methyl (E)-cinnamate,
Flavour Fragr. J., 2004, 19, 3, 260-262, https://doi.org/10.1002/ffj.1301
. [all data]
Jürgens and Dötterl, 2004
Jürgens, A.; Dötterl, S.,
Chemical composition of anther volatiles in Ranunculaceae: genera-specific profiles in Aemone, Aquilegia, Caltha, Pulsatilla, Ranunculus, and Trollius species,
American Journal of Botany, 2004, 91, 12, 1969-1980, https://doi.org/10.3732/ajb.91.12.1969
. [all data]
Kalvandi, Sefidkon, et al., 2004
Kalvandi, R.; Sefidkon, F.; Atri, M.; Mirza, M.,
Analysis of the essential oil of Thymus eriocalyx from Iran,
Flavour Fragr. J., 2004, 19, 4, 341-343, https://doi.org/10.1002/ffj.1312
. [all data]
Kalemba and Thiem, 2004
Kalemba, D.; Thiem, B.,
Constituents of the essential oils of four micropropagated Solidago species,
Flavour Fragr. J., 2004, 19, 1, 40-43, https://doi.org/10.1002/ffj.1271
. [all data]
Kilic, Hafizoglu, et al., 2004
Kilic, A.; Hafizoglu, H.; Kollmannsberger, H.; Nitz, S.,
Volatile constituents and key odorants in leaves, buds, flowers, and fruits of Laurus nobilis L.,
J. Agric. Food Chem., 2004, 52, 6, 1601-1606, https://doi.org/10.1021/jf0306237
. [all data]
Lago, de Ávila, et al., 2004
Lago, J.H.G.; de Ávila, P., Jr.; de Aquino, E.M.; Moreno, P.R.H.; Ohara, M.T.; Limberger, R.P.; Apel, M.A.; Henriques, A.T.,
Volatile oils from leaves and stem barks of Cedrela fissilis (Meliaceae): chemical composition and antibacterial activities,
Flavour Fragr. J., 2004, 19, 5, 448-451, https://doi.org/10.1002/ffj.1347
. [all data]
paz Lima, Silva, et al., 2004
paz Lima, M.; Silva, T.M.D.; da Silva, J.D.; Zoghbi, M.G.B.; Andrade, E.H.A.,
Essential oil composition of leaf and fine stem of Aniba canelilla (Kunth) Mez from Manaus, Brazil.,
Acta Amazonica, 2004, 34, 2, 329-330, https://doi.org/10.1590/S0044-59672004000200019
. [all data]
Limberger, Sobral, et al., 2004
Limberger, R.P.; Sobral, M.; Henriques, A.T.; Menut, C.; Bessière, J.-M.,
Óleos voláteis de espécies de Myrcia nativas do rio grande do sul,
Quim. Nova, 2004, 27, 6, 916-919, https://doi.org/10.1590/S0100-40422004000600015
. [all data]
Marongiu, Porcedda, et al., 2004
Marongiu, B.; Porcedda, A.P.S.; Casu, R.; Pierucci, P.,
Chemical composition of the oil and supercritical CO2 extract of Schinus molle L.,
Flavour Fragr. J., 2004, 19, 6, 554-558, https://doi.org/10.1002/ffj.1350
. [all data]
Mehrabani, Asadipour, et al., 2004
Mehrabani, M.; Asadipour, A.; Amoli, S.S.,
Chemical constituents of the essential oil of NEPETA DEPAUPERATA BENTH. from Iran,
DARu: Journal of Faculty of Pharmacy, 2004, 12, 98-100. [all data]
Mevy, Bessiere, et al., 2004
Mevy, J.P.; Bessiere, J.M.; Pelissier, Y.; Masotti, V.; Ruzzier, M.; Rabier, J.; Viano, J.,
Composition of the volatile constituents of the aerial parts of an endemic plant of Ivory Coast, Monanthotaxis capea (E.G. A. Camus) Verdc,
Flavour Fragr. J., 2004, 19, 6, 526-528, https://doi.org/10.1002/ffj.1329
. [all data]
Mimica-Dukic, Bozin, et al., 2004
Mimica-Dukic, N.; Bozin, B.; Sokovic, M.; Simin, N.,
Antimicrobial and antioxidant activities of Melissa officinalis L. (Lamiaceae) essential oil,
J. Agric. Food Chem., 2004, 52, 9, 2485-2489, https://doi.org/10.1021/jf030698a
. [all data]
Miyazawa, Fuhita, et al., 2004
Miyazawa, M.; Fuhita, T.; Yamafuji, C.; Matsui, M.; Kasahara, N.; Takagi, Y.; Ishikawa, Y.,
Chemical composition of volatile oil from the roots of Periploca sepium,
J. Oleo Sci., 2004, 53, 10, 511-513, https://doi.org/10.5650/jos.53.511
. [all data]
Miyazawa, Fujita, et al., 2004
Miyazawa, M.; Fujita, T.; Yamafuji, C.; Matsui, M.; Kasahara, N.; Takagi, Y.; Ishikawa, Y.,
Chemical composition of volatile oil from the roots of Periploca sepium,
J. Oleo Sci., 2004, 53, 11, 511-513, https://doi.org/10.5650/jos.53.511
. [all data]
Orav, Stulova, et al., 2004
Orav, A.; Stulova, I.; Kailas, T.; Müürisepp, M.,
Effect of storage on the essential oil composition of piper nigrum L. fruits of different ripening states,
J. Agric. Food Chem., 2004, 52, 9, 2582-2586, https://doi.org/10.1021/jf030635s
. [all data]
Shafi, Nambiar, et al., 2004
Shafi, P.M.; Nambiar, M.K.G.; Clery, R.A.; Sarma, Y.R.; Veena, S.S.,
Composition and antifungal activity of the oil of Artemisia nilagirica (Clarke) Pamp,
J. Essent. Oil Res., 2004, 16, 4, 377-379, https://doi.org/10.1080/10412905.2004.9698748
. [all data]
Simic, Sokovic, et al., 2004
Simic, A.; Sokovic, M.D.; Ristic, M.; Grujic-Jovanovic, S.; Vukojevic, J.; Marin, P.D.,
The chemical composition of some Lauraceae essential oils and their antifungal activities,
Phytother. Res., 2004, 18, 9, 713-717, https://doi.org/10.1002/ptr.1516
. [all data]
Suyenaga, Apel, et al., 2004
Suyenaga, E.S.; Apel, M.A.; Chaves, C.G.; Zuanazzi, J.A.; Henriques, A.T.,
Essential oil composition of Heterothalamus psiadioides Less,
Biochem. Syst. Ecol., 2004, 32, 1, 83-86, https://doi.org/10.1016/S0305-1978(03)00190-X
. [all data]
Cabanillas, Lopez, et al., 2003
Cabanillas, C.M.; Lopez, M.L.; Daniele, G.; Zygadlo, J.A.,
Essential oil composition of Aloysia polystachya (Griseb.) Moldenke under rust disease,
Flavour Fragr. J., 2003, 18, 5, 446-448, https://doi.org/10.1002/ffj.1249
. [all data]
Couladis, Özcan, et al., 2003
Couladis, M.; Özcan, M.; Tzakou, O.; Akgül, A.,
Comparative essential oil composition of various parts of the turpentine tree (Pistacia terebinthus L) growing wild in Turkey,
J. Sci. Food Agric., 2003, 83, 2, 136-138, https://doi.org/10.1002/jsfa.1295
. [all data]
Feizbaksh, Saber Tehrani, et al., 2003
Feizbaksh, A.; Saber Tehrani, M.; Rustaiyan, A.; Masoudi, S.,
Composition of the essential oil of Stachys lavandulifolia Vahl. from Iran,
J. Essent. Oil Res., 2003, 15, 2, 72-73, https://doi.org/10.1080/10412905.2003.9712068
. [all data]
Fekam Boyom, Ngouana, et al., 2003
Fekam Boyom, F.; Ngouana, V.; Amvam Zollo, P.H.; Menut, C.; Bessiere, J.M.; Gut, J.; Rosenthal, P.J.,
Composition and anti-plasmodial activities of essential oils from some Cameroonian medicinal plants,
Phytochemistry, 2003, 64, 7, 1269-1275, https://doi.org/10.1016/j.phytochem.2003.08.004
. [all data]
Ghasemi, Asghari, et al., 2003
Ghasemi, N.; Asghari, G.; Ardakani, M.S.; Siahpoush, A.,
Characterization of volatile constituents from aerial parts of varthemia persica DC (var. persica),
Iran. J. Pharm. Res., 2003, 2, 241-243. [all data]
Jirovetz, Buchbauer, et al., 2003
Jirovetz, L.; Buchbauer, G.; Shafi, M.P.; Kaniampady, M.M.,
Chemotaxonomical analysis of the essential oil aroma compounds of four different Ocimumspecies from southern India,
Eur. Food Res. Technol., 2003, 217, 2, 120-124, https://doi.org/10.1007/s00217-003-0708-1
. [all data]
Jirovetz, Buchbauer, et al., 2003, 2
Jirovetz, L.; Buchbauer, G.; Shafi, M.P.; Leela, N.K.,
Analysis of the essential oils of the leaves, stems, rhizomes and roots of the medicinal plant Alpinia galanga from southern India,
Acta Pharm. Hung., 2003, 53, 73-81. [all data]
Juteau, Jerkovic, et al., 2003
Juteau, F.; Jerkovic, I.; Masotti, V.; Milos, M.; Mastelic, J.; Bessière, J.-M.; Viano, J.,
Composition and antimicrobial activity of the essential oil of Artemisia absinthium from Croatia and France,
Planta Medica, 2003, 69, 2, 158-161, https://doi.org/10.1055/s-2003-37714
. [all data]
Limberger, Simões-Pires, et al., 2003
Limberger, R.P.; Simões-Pires, C.A.; Sobral, M.; Menut, C.; Bessiere, J.-M.; Henriques, A.T.,
Essential oils of six Gomidesia spp. from southern Brazil,
Flavour Fragr. J., 2003, 18, 2, 144-147, https://doi.org/10.1002/ffj.1122
. [all data]
Mahalwal and Ali, 2003
Mahalwal, V.S.; Ali, M.,
Volatile constituents of Cymbopogon nardus (Linn.) rendle,
Flavour Fragr. J., 2003, 18, 1, 73-76, https://doi.org/10.1002/ffj.1144
. [all data]
Maia, Taveira, et al., 2003
Maia, J.G.S.; Taveira, F.S.N.; Andrade, E.H.A.; da Silva, M.H.L.; Zoghbi, M.G.B.,
Essential oils of Lippia grandis Schau.,
Flavour Fragr. J., 2003, 18, 5, 417-420, https://doi.org/10.1002/ffj.1241
. [all data]
Marongiu, Porcedda, et al., 2003
Marongiu, B.; Porcedda, S.; Caredda, A.; de Gioannis, B.; Vargiu, L.; la Colla, P.,
Extraction of Juniperus oxycedrus ssp. Oxycedrus essential oil by supercritical carbon dioxide: influence of some process parameters and biological activity,
Flavour Fragr. J., 2003, 18, 5, 390-397, https://doi.org/10.1002/ffj.1224
. [all data]
Masotti, Juteau, et al., 2003
Masotti, V.; Juteau, F.; Bessière, J.M.; Viano, J.,
Seasonal and phenological variations of the essential oil from the narrow endemic species Artemisia molinieri and its biological activities,
J. Agric. Food Chem., 2003, 51, 24, 7115-7121, https://doi.org/10.1021/jf034621y
. [all data]
Mierendorff, Stahl-Biskup, et al., 2003
Mierendorff, H.-G.; Stahl-Biskup, E.; Posthumus, M.A.; van Beek, T.A.,
Composition of commercial Cape chamomile oil (Eriocephalus punctulatus),
Flavour Fragr. J., 2003, 18, 6, 510-514, https://doi.org/10.1002/ffj.1259
. [all data]
Mirza and Nik, 2003
Mirza, M.; Nik, Z.B.,
Volatile constituents of Phlomis olivieri Benth. from Iran,
Flavour Fragr. J., 2003, 18, 2, 131-132, https://doi.org/10.1002/ffj.1156
. [all data]
Pitarokili, Tzakou, et al., 2003
Pitarokili, D.; Tzakou, O.; Loukis, A.; Harvala, C.,
Volatile metabolites from Salvia fruticosa as antifungal agents in soilborne pathogens,
J. Agric. Food Chem., 2003, 51, 11, 3294-3301, https://doi.org/10.1021/jf0211534
. [all data]
Sajjadi and Mehregan, 2003
Sajjadi, S.E.; Mehregan, I.,
Chemical composition of the essential oil of Prangos Asperula Boiss. subsp. haussknechtii (Boiss.) Hernst. et Heyn fruits, 2003, retrieved from http://www1.tums.ac.ir/daru/daru2%2020003/Dr%20Sajadi.PDF. [all data]
Shahmir, Ahmadi, et al., 2003
Shahmir, F.; Ahmadi, L.; Mirza, M.; Korori, S.A.A.,
Secretory elements of needles and berries of Juniperus communis L. ssp. communis and its volatile constituents,
Flavour Fragr. J., 2003, 18, 5, 425-428, https://doi.org/10.1002/ffj.1243
. [all data]
da Silva, Luz, et al., 2003
da Silva, J.D.; Luz, A.I.R.; da Silva, M.H.L.; Andrade, E.H.A.; Soghbi, M.G.B.; Maia, J.G.S.,
Essential oils of the leaves and stems of four Psidium spp.,
Flavour Fragr. J., 2003, 18, 3, 240-243, https://doi.org/10.1002/ffj.1219
. [all data]
Taiwo and Bolanle, 2003
Taiwo, A.O.; Bolanle, A.A.,
The leaf essential oil of Costus afer Ker-Grawl from Nigeria,
Flavour Fragr. J., 2003, 18, 4, 309-311, https://doi.org/10.1002/ffj.1186
. [all data]
Taveira, de Lima, et al., 2003
Taveira, F.S.N.; de Lima, W.N.; Andrade, E.H.A.; Maia, J.G.S.,
Seasonal essential oil variation of Aniba canelilla,
Biochem. Syst. Ecol., 2003, 31, 1, 69-75, https://doi.org/10.1016/S0305-1978(02)00088-1
. [all data]
Yassa, Akhani, et al., 2003
Yassa, N.; Akhani, H.; Aqaahmadi, M.; Salimian, M.,
Essential oils from two endemic species of Apiaceae from Iran,
Z. Naturforsch. C:, 2003, 58, 459-463. [all data]
Zoghbi, Andrade, et al., 2003
Zoghbi, M.G.B.; Andrade, E.H.A.; da Silva, M.H.; Carreira, L.M.M.; Maia, J.G.S.,
Essential oils from three Myrcia species,
Flavour Fragr. J., 2003, 18, 5, 421-424, https://doi.org/10.1002/ffj.1242
. [all data]
Boyom, Keumedjio, et al., 2002
Boyom, F.F.; Keumedjio, F.; Dongmo, P.M.J.; Ngadjui, B.T.; Zollo, A.; Menut, C.; Bessiere, J.M.,
Essential oils from Croton zambesicus Muell. Arg. growing in Cameroon,
Flavour Fragr. J., 2002, 17, 3, 215-217, https://doi.org/10.1002/ffj.1081
. [all data]
Caredda, Marongiu, et al., 2002
Caredda, A.; Marongiu, B.; Porcedda, S.; Soro, C.,
Supercritical carbon dioxide extraction and characterization of Laurus nobilis essential oil,
J. Agric. Food Chem., 2002, 50, 6, 1492-1496, https://doi.org/10.1021/jf0108563
. [all data]
Cicció and Gómez-Laurito, 2002
Cicció, J.F.; Gómez-Laurito, J.,
Volatile constituents of the leaves of Siparuna thecaphora (Siparunaceae) from Turrialba, Costa Rica,
Rev. Biol. Trop., 2002, 50, 3/4, 963-967. [all data]
Congiu, Falconieri, et al., 2002
Congiu, R.; Falconieri, D.; Marongiu, B.; Piras, A.; Porcedda, S.,
Extraction and isolation of Pistacia lentiscus L. essential oil by supercritical CO2,
Flavour Fragr. J., 2002, 17, 4, 239-244, https://doi.org/10.1002/ffj.1095
. [all data]
Farah, Fechtal. M., et al., 2002
Farah, A.; Fechtal. M.; Chaouch, A.; Zrira, S.,
The essential oils of Eucalyptus camaldulensis and its natural hybrid (clone 583) from Morocco,
Flavour Fragr. J., 2002, 17, 5, 395-397, https://doi.org/10.1002/ffj.1114
. [all data]
Flamini, Ertugrul, et al., 2002
Flamini, G.; Ertugrul, K.; Cioni, P.L.; Morelli, I.; Dural, H.; Bagci, Y.,
Volatile constituents of two endemic Centaurea species from Turkey: C. pseudoscabiosa subsp. pseudoscabiosa and C. hadimensis,
Biochem. Syst. Ecol., 2002, 30, 10, 953-959, https://doi.org/10.1016/S0305-1978(02)00043-1
. [all data]
Kabouss, Charrouf, et al., 2002
Kabouss, A.E.; Charrouf, Z.; Faid, M.; Garneau, F.-X.; Collin, G.,
Chemical composition and antimicrobial activity of the leaf essential oil of Argania spinosa L. Skeels,
J. Essent. Oil Res., 2002, 14, 2, 147-149, https://doi.org/10.1080/10412905.2002.9699801
. [all data]
Kobaisy, Tellez, et al., 2002
Kobaisy, M.; Tellez, M.R.; Dayan, F.E.; Duke, S.O.,
Phytotoxicity and volatile constituents from leaves of Callicarpa japonica Thunb.,
Phytochemistry, 2002, 61, 1, 37-40, https://doi.org/10.1016/S0031-9422(02)00207-8
. [all data]
Krauze-Baranowska, Mardarowicz, et al., 2002
Krauze-Baranowska, M.; Mardarowicz, M.; Wiwart, M.; Poblocka, L.; Dynowska, M.,
Antifungal activity of the essential oils from some species of the genus Pinus,
Z. Naturforsch., 2002, 57c, 478-482. [all data]
Kuiate, Bessière, et al., 2002
Kuiate, J.-R.; Bessière, J.-M.; Zollo, P.-H.A.,
Composition of the essential oils from three Laggera Spp. from Cameroon,
Flavour Fragr. J., 2002, 17, 2, 105-108, https://doi.org/10.1002/ffj.1057
. [all data]
Limberger, Simões-Pires, et al., 2002
Limberger, R.P.; Simões-Pires, C.; Sobral, M.; Menu, C.; Bessiere, J.-M.; Henriques, A.T.,
Essential oils from some Myrceugenia species (Myrtaceae),
Flavour Fragr. J., 2002, 17, 5, 341-344, https://doi.org/10.1002/ffj.1113
. [all data]
Lin, Rouseff, et al., 2002
Lin, J.; Rouseff, R.L.; Barros, S.; Naim, M.,
Aroma composition changes in early season grapefruit juice produced from thermal concentration,
J. Agric. Food Chem., 2002, 50, 4, 813-819, https://doi.org/10.1021/jf011154g
. [all data]
Maia, da Silva, et al., 2002
Maia, J.G.S.; da Silva, M.H.L.; Andrade, E.H.A.; Zoghbi, M.G.B.; Carreira, L.M.M.,
Essential oils from Astronium urundeuva (Allemao) Engl. and A. fraxinifolium Schott ex Spreng.,
Flavour Fragr. J., 2002, 17, 1, 72-74, https://doi.org/10.1002/ffj.1046
. [all data]
Maia, Zoghbi, et al., 2002
Maia, J.G.S.; Zoghbi, M.G.B.; Andrade, E.H.A.; da Silva, M.H.L.; Luz, A.I.R.; da Silva, J.D.,
Essential oils composition of Eupatorium species growing wild in the Amazon,
Biochem. Syst. Ecol., 2002, 30, 11, 1071-1077, https://doi.org/10.1016/S0305-1978(02)00059-5
. [all data]
Norouzi-Arasi, Yavari, et al., 2002
Norouzi-Arasi, H.; Yavari, I.; Ghaffarzadeh, F.; Mortazavi, M.-S.,
Volatile constituents of Cymbopogon olivieri (Boiss.) Bor from Iran,
Flavour Fragr. J., 2002, 17, 4, 272-274, https://doi.org/10.1002/ffj.1096
. [all data]
Priestap, van Baren, et al., 2002
Priestap, H.A.; van Baren, C.M.; Lira, P.D.L.; Prado, H.J.; Neugebauer, M.; Mayer, R.; Bandoni, A.L.,
Essential oils from aerial parts of Aristolochia gibertii Hook.,
Flavour Fragr. J., 2002, 17, 1, 69-71, https://doi.org/10.1002/ffj.1044
. [all data]
Ruberto, Biondi, et al., 2002
Ruberto, G.; Biondi, D.; Barbagallo, C.; Meli, R.; Savoca, F.,
Constituents of stem and flower oils of Helichrysum litoreum Guss.,
Flavour Fragr. J., 2002, 17, 1, 46-48, https://doi.org/10.1002/ffj.1037
. [all data]
Schwob, Bessière, et al., 2002
Schwob, I.; Bessière, J.-M.; Viano, J.,
Composition of the essential oils of Hypericum perforatum L. from southeastern France,
C.R. Acad. Sci. Ser. 3:, 2002, 325, 781-785. [all data]
Velasco-Negueruela, Pérez-Alonso, et al., 2002
Velasco-Negueruela, A.; Pérez-Alonso, M.J.; Palá-Paúl, J.; Íñigo, A.; López, G.,
Leaf essential oils analysis of Juniperus navicularis Gandoger,
Botanica Complutensis, 2002, 26, 85-91. [all data]
Zoghbi, Andrade, et al., 2002
Zoghbi, M.G.B.; Andrade, E.H.A.; da Silva, M.H.L.; Maia, J.G.S.,
Volatile constituents of Lippia lupulina Cham.,
Flavour Fragr. J., 2002, 17, 1, 29-31, https://doi.org/10.1002/ffj.1032
. [all data]
Zoghbi, Andrade, et al., 2002, 2
Zoghbi, M.G.B.; Andrade, E.H.A.; da Silva, M.H.; Maia, J.G.S.; Luz, A.I.R.; da Silva, J.D.,
Chemical variation in the essential oils of Hyptis crenata Pohl ex Benth.,
Flavour Fragr. J., 2002, 17, 1, 5-8, https://doi.org/10.1002/ffj.1031
. [all data]
Bailac, Dellacasa, et al., 2001
Bailac, P.N.; Dellacasa, A.D.; Bernasconi, H.O.; Ponzi, M.I.; Firpo, N.H.,
Essential oil of female plants of Baccharis coridifolia De Candole,
J. Essent. Oil Res., 2001, 13, 1, 23-24, https://doi.org/10.1080/10412905.2001.9699593
. [all data]
Campeol, Flamini, et al., 2001
Campeol, E.; Flamini, G.; Chericoni, S.; Catalano, S.; Cremonini, R.,
Volatile compounds from three cultivars of Olea europaea from Italy,
J. Agric. Food Chem., 2001, 49, 11, 5409-5411, https://doi.org/10.1021/jf010455n
. [all data]
Flamini, Cioni, et al., 2001
Flamini, G.; Cioni, P.L.; Morelli, I.; Maccioni, S.; Monti, G.,
Composition of the essential oil of Teucrium fruticans L. from the Maremma Regional Park (Tuscany, Italy),
Flavour Fragr. J., 2001, 16, 5, 367-369, https://doi.org/10.1002/ffj.1014
. [all data]
Jirovetz L., Buchbauer G., et al., 2001
Jirovetz L.; Buchbauer G.; Shafi P.M.; Rosamma M.K.; Geissler M.,
Analysis of the composition and aroma of the essential leaf oil of Syzygium travancoricum from South India by GC-FID, GC-MS, and olfactometry. Seasonal changes of composition,
Chromatographia Sup., 2001, 53, S1, s372-s374, https://doi.org/10.1007/BF02490359
. [all data]
Kalemba, Marschall, et al., 2001
Kalemba, D.; Marschall, H.; Bradesi, P.,
Constituents of the essential oil of Solidago gigantea Ait. (giant goldenrod),
Flavour Fragr. J., 2001, 16, 1, 19-26, https://doi.org/10.1002/1099-1026(200101/02)16:1<19::AID-FFJ940>3.0.CO;2-U
. [all data]
Palmeira, Conserva, et al., 2001
Palmeira, S.F., Jr.; Conserva, L.M.; Andrade, E.H.A.; Guilhon, G.M.S.P.,
Analysis by GC-MS of the hexane extract of the aerial parts of Aristolochia acutifolia Duchtr.,
Flavour Fragr. J., 2001, 16, 2, 85-88, https://doi.org/10.1002/1099-1026(200103/04)16:2<85::AID-FFJ948>3.0.CO;2-2
. [all data]
Tellez M., Estell R., et al., 2001
Tellez M.; Estell R.; Fredrickson E.; Powell J.; Wedge D.; Schrader K.; Kobaisy M.,
Extracts of Flourensia cernua (L): Volatile constituents and antifungal, antialgal, and antitermite bioactivities,
J. Chem. Ecol., 2001, 27, 11, 2263-2273, https://doi.org/10.1023/A:1012283005014
. [all data]
Feger, Brandauer, et al., 2000
Feger, W.; Brandauer, H.; Ziegler, H.,
Sesquiterpene hydrocarbons of cold-pressed lime oils,
Flavour Fragr. J., 2000, 15, 4, 281-284, https://doi.org/10.1002/1099-1026(200007/08)15:4<281::AID-FFJ916>3.0.CO;2-W
. [all data]
Tamura, Boonbumrung, et al., 2000
Tamura, H.; Boonbumrung, S.; Yoshizawa, T.; Varanyanond, W.,
Volatile components of the essential oil in the pulp of four yellow mangoes (Mangifera indica L.) in Thailand,
Food Sci. Technol. Res., 2000, 6, 1, 68-73, https://doi.org/10.3136/fstr.6.68
. [all data]
Tellez, Dayan, et al., 2000
Tellez, M.R.; Dayan, F.E.; Schrader, K.K.; Wedge, D.E.; Duke, S.O.,
Composition and some biological activities of the essential oils of Callicarpa Americana (L.),
J. Agric. Food Chem., 2000, 48, 7, 3008-3012, https://doi.org/10.1021/jf991026g
. [all data]
Ali N.A.M. and Jantan, 1999
Ali N.A.M.; Jantan, I.,
Essential oil of cinnamomum tahijanum kost. from sarawak,
ASEAN Review of BiodiversityEnvironment Conservation, 1999, November-December, 1-4. [all data]
Mohd and Jantan, 1999
Mohd, N.A.; Jantan, I.,
Essential oil of cinnamomum tahijanum Kost. from Sarawak, 1999, retrieved from http://www.arbec.com.my/pdf/art5novdec99.pdf. [all data]
Oyedeji, Olawore, et al., 1999
Oyedeji, A.O.; Olawore, O.N.; Ekundayo, O.; Koenig, W.A.,
Volatile leaf oil constituents of three Eucalyptus species from Nigeria,
Flavour Fragr. J., 1999, 14, 4, 241-244, https://doi.org/10.1002/(SICI)1099-1026(199907/08)14:4<241::AID-FFJ820>3.0.CO;2-Y
. [all data]
Porta, Porcedda, et al., 1999
Porta, G.D.; Porcedda, S.; Marongiu, B.; Reverchon, E.,
Isolation of eucalyptus oil by supercritical fluid extraction,
Flavour Fragr. J., 1999, 14, 4, 214-218, https://doi.org/10.1002/(SICI)1099-1026(199907/08)14:4<214::AID-FFJ814>3.0.CO;2-H
. [all data]
Tellez, Canel, et al., 1999
Tellez, M.R.; Canel, C.; Rimando, A.M.; Duke, S.O.,
Differential accumulation of isoprenoids in glanded and glandless Artemisia annua L,
Phytochemistry, 1999, 52, 6, 1035-1040, https://doi.org/10.1016/S0031-9422(99)00308-8
. [all data]
Weyerstahl, Marschall, et al., 1999, 2
Weyerstahl, P.; Marschall, H.; Thefeld, K.; Rustaiyan, A.,
Constituents of the essential oil of Tanacetum (syn. Chrysanthemum) fruticulosum Ledeb. from Iran,
Flavour Fragr. J., 1999, 14, 2, 112-120, https://doi.org/10.1002/(SICI)1099-1026(199903/04)14:2<112::AID-FFJ786>3.0.CO;2-1
. [all data]
Zoghbi, Andrade, et al., 1999
Zoghbi, M.G.B.; Andrade, E.H.A.; Maia, J.G.S.,
Volatile constituents from leaves and flowers of Alpinia speciosa K. Schum. and A. purpurata (Viell.) Schum.,
Flavour Fragr. J., 1999, 14, 6, 411-414, https://doi.org/10.1002/(SICI)1099-1026(199911/12)14:6<411::AID-FFJ854>3.0.CO;2-U
. [all data]
Doneanu and Anitescu, 1998
Doneanu, C.; Anitescu, G.,
Supercritical carbon dioxide extraction of Angelica archangelica L. root oil,
J. Supercrit. Fluids, 1998, 12, 1, 59-67, https://doi.org/10.1016/S0896-8446(97)00040-5
. [all data]
Maia, Zohhbi, et al., 1998
Maia, J.G.S.; Zohhbi, M.G.B.; Andrade, E.H.A.; Santos, A.S.; da Silva, M.H.L.; Luz, A.I.R.; Bastos, C.N.,
Constituents of the essential oil of Piper aduncum L. growing wild in the Amazon region,
Flavour Fragr. J., 1998, 13, 4, 269-272, https://doi.org/10.1002/(SICI)1099-1026(1998070)13:4<269::AID-FFJ744>3.0.CO;2-A
. [all data]
Santos, Andrade, et al., 1998
Santos, A.S.; Andrade, E.H.A.; Zoghbi, M. das.G.B.; Luz, A.I.R.; Maia, J.G.S.,
Sesquiterpenes of Amazonian Piper species,
Acta Amazomica, 1998, 28, 2, 127-130. [all data]
Elias, Simoneit, et al., 1997
Elias, V.O.; Simoneit, B.R.T.; Cardoso, J.N.,
Analysis of volatile sesquiterpenoids in environmental and geological samples,
J. Hi. Res. Chromatogr., 1997, 20, 6, 305-309, https://doi.org/10.1002/jhrc.1240200602
. [all data]
Reverchon, Porta, et al., 1997
Reverchon, E.; Porta, G.D.; Gorgoglione, D.,
Supercritical CO2 extraction of volatile oil from rose concrete,
Flavour Fragr. J., 1997, 12, 1, 37-41, https://doi.org/10.1002/(SICI)1099-1026(199701)12:1<37::AID-FFJ605>3.0.CO;2-V
. [all data]
Tellez, Estell, et al., 1997
Tellez, M.R.; Estell, R.E.; Frederickson, E.L.; Havstad, K.M.,
Essntial oil of Flourensia cernua DC,
J. Essent. Oil Res., 1997, 9, 6, 619-624, https://doi.org/10.1080/10412905.1997.9700799
. [all data]
Zygadlo, Ariza-Espinar, et al., 1997
Zygadlo, J.A.; Ariza-Espinar, L.; Velasco-Negueruela, A.; Perez-Alonso, M.J.,
Volatile constituents of Stevia achalensis hieronymus,
Flavour Fragr. J., 1997, 12, 4, 297-299, https://doi.org/10.1002/(SICI)1099-1026(199707)12:4<297::AID-FFJ625>3.0.CO;2-2
. [all data]
Chacko, Jayalekshmy, et al., 1996
Chacko, S.; Jayalekshmy, A.; Gopalakrishnan, M.; Narayanan, C.S.,
Roasting studies on black pepper (Piper nigrum L.),
Flavour Fragr. J., 1996, 11, 5, 305-310, https://doi.org/10.1002/(SICI)1099-1026(199609)11:5<305::AID-FFJ588>3.0.CO;2-1
. [all data]
Gawdzik, Mardarowicz, et al., 1996
Gawdzik, J.; Mardarowicz, M.; Suprynowicz, Z.; Kawka, S.; Wolski, T.,
Supercritical fluid extraction of essential oils from the fruits of Archangelica off. Hoffm. and their characterization by GC/MS,
J. Hi. Res. Chromatogr., 1996, 19, 4, 237-240, https://doi.org/10.1002/jhrc.1240190416
. [all data]
Stashenko, Puertas, et al., 1996
Stashenko, E.E.; Puertas, M.A.; Combariza, M.Y.,
Volatile secondary metabolites from Spilanthes americana obtained by simultaneous steam distillation--solvent extraction and supercritical fluid extraction,
J. Chromatogr. A, 1996, 752, 1-2, 223-232, https://doi.org/10.1016/S0021-9673(96)00480-3
. [all data]
Wong and Lai, 1996
Wong, K.C.; Lai, F.Y.,
Volatile constituents from the fruits of four Syzygium species grown in Malaysia,
Flavour Fragr. J., 1996, 11, 1, 61-66, https://doi.org/10.1002/(SICI)1099-1026(199601)11:1<61::AID-FFJ539>3.0.CO;2-1
. [all data]
Binder and French, 1994
Binder, R.G.; French, R.C.,
Volatile components of Canada thistle,
J. Agric. Food Chem., 1994, 42, 12, 2942-2945, https://doi.org/10.1021/jf00048a056
. [all data]
Ramanoelina, Viano, et al., 1994
Ramanoelina, P.A.R.; Viano, J.; Bianchini, J.-P.; Gaydou, E.M.,
Occurrence of various chemotypes in Niaouli (Melaleuca quinquenervia) essential oils from Madagascar using multivariate statistical analysis,
J. Agric. Food Chem., 1994, 42, 5, 1177-1182, https://doi.org/10.1021/jf00041a024
. [all data]
Everaerts, Roisin, et al., 1993
Everaerts, C.; Roisin, Y.; Le Quere, J.-L.; Bonnard, O.; Pasteels, J.M.,
Sesquiterpenes in the frontal gland secretion of nasute soldier termites from New Guinea,
J. Chem. Ecol., 1993, 19, 12, 2865-2879, https://doi.org/10.1007/BF00980588
. [all data]
Gopalakrishnan, Menon, et al., 1993
Gopalakrishnan, M.; Menon, N.; Padmakumari, K.P.; Jayalekshmy, A.; Narayanan, C.S.,
GC Analysis and Odor Profiles of Four New Indian Genotypes of Piper nigrum L.,
J. Essent. Oil Res., 1993, 5, 3, 247-253, https://doi.org/10.1080/10412905.1993.9698217
. [all data]
Kaul, Singh, et al., 1993
Kaul, V.K.; Singh, B.; Sood, R.P.,
Volatile Constituents of the Essential Oil of Tanacetum longifolium Wall.,
J. Essent. Oil Res., 1993, 5, 6, 597-601, https://doi.org/10.1080/10412905.1993.9698290
. [all data]
Tkachenko and Zenkevich, 1993
Tkachenko, K.G.; Zenkevich, I.G.,
The Essential Oil of the Flowers of Heracleum antasiaticum Manden, Grown in Russia,
J. Essent. Oil Res., 1993, 5, 2, 227-228. [all data]
Kollmannsberger, Nitz, et al., 1992
Kollmannsberger, H.; Nitz, S.; Drawert, F.,
UBer die Aromastoffzusammensetzung von Hochdruckextrakten. I. Pfeffer (Piper nigrum, Var. muntok),
Z. Lebensm. Unters Forsch., 1992, 194, 6, 545-551, https://doi.org/10.1007/BF01185481
. [all data]
Binder, Benson, et al., 1990
Binder, R.G.; Benson, M.E.; Flath, R.A.,
Volatile Components of Safflower,
J. Agric. Food Chem., 1990, 38, 5, 1245-1248, https://doi.org/10.1021/jf00095a020
. [all data]
Binder, Turner, et al., 1990
Binder, R.G.; Turner, C.E.; Flath, R.A.,
Volatile components of purple starthistle,
J. Agric. Food Chem., 1990, 38, 4, 1053-1055, https://doi.org/10.1021/jf00094a030
. [all data]
Binder, Turner, et al., 1990, 2
Binder, R.G.; Turner, C.E.; Flath, R.A.,
Comparison of yellow starthistle volatiles from different plant parts,
J. Agric. Food Chem., 1990, 38, 3, 764-767, https://doi.org/10.1021/jf00093a038
. [all data]
Binder and Flath, 1989
Binder, R.G.; Flath, R.A.,
Volatile components of pineapple guava,
J. Agric. Food Chem., 1989, 37, 3, 734-736, https://doi.org/10.1021/jf00087a034
. [all data]
Ramaswami, Briscese, et al., 1988
Ramaswami, S.K.; Briscese, P.; Gargiullo, R.J.; von Geldern, T.,
Sesquiterpene hydrocarbons: from mass confusion to orderly line-up
in Flavors and Fragrances: A World Perspective. Proceedings of the 10th International Congress of Essential Oils, Fragrances and Flavors, Lawrence,B.M.; Mookherjee,B.D.; Willis,B.J., ed(s)., Elsevier, New York, 1988, 951-980. [all data]
de Pooter, de Buyck, et al., 1986
de Pooter, H.L.; de Buyck, L.F.; Schamp, N.M.; Aboutabl, E.; De Bruyn, A.; Husain, S.Z.,
The Volatile Fraction of Senecio glaucus subsp. coronopifolius,
Flavour Fragr. J., 1986, 1, 4-5, 159-163, https://doi.org/10.1002/ffj.2730010406
. [all data]
Ramaswami, Briscese, et al., 1986
Ramaswami, S.K.; Briscese, P.; Gargiullo, R.J.; von Geldern, T.,
Sesquiterpene hydrocarbons: from mass confusion to orderly line-up
in Flavors and Fragrances: A World Perspective, Lawrence,B.M.; Mookherjee,B.D.; Willis,B.J., ed(s)., Proceedings of the 10th International Congress of Essential Oils, Fragrances, and Flavors, Washington, DC, 1986, 951-959. [all data]
de Morais, Oliveira, et al., 2012
de Morais, S.R.; Oliveira, T.L.S.; BAra, M.T.F.; da Conceicao, E.C.; Rezende, M.H.; Ferri, P.H.; de Paula, J.R.,
Chemical constituents of essential oil from Lippia sidoides Cham. (Verbenaceae) leaves cultivated in Hidrolandia, Goias, Brasil,
Int. J. Anal. Chem., 2012, 2012, 1-4, https://doi.org/10.1155/2012/363919
. [all data]
Shivashankar, Roy, et al., 2012
Shivashankar, S.; Roy, T.K.; Moorthy, P.N.R.,
Headspace solid phase micro extraction and GC/MS analysis of the volatile components in seed and cake of Azadirachta indica A. juss,
Chem. Bull. of Politechnika Univ. Timisoara, Romania, 2012, 57(71), 1, 1-6. [all data]
Chaverri, Diaz, et al., 2011
Chaverri, C.; Diaz, C.; Cicco, J.F.,
Chemical analysis of essential oils from Ocotea gomezii W.C. Burger and Ocotea morae Gomez-Laur. (Lauraceae) collected at Reserva biologica Alberto M. Brenes in Costa Rica and their cytotoxic activity on Tumor cell lines,
J. Braz. Chem. Soc., 2011, 22, 4, s1-s4, https://doi.org/10.1590/S0103-50532011000400018
. [all data]
Laribi, Kouki, et al., 2011
Laribi, B.; Kouki, K.; Sahli, A.; Mougou, A.; Marzouk, B.,
Essential oil fatty acids composition of a Tunisian caraway (Carum carvi L.) seed ecotype cultivated under water deficit,
Adv. Environ. Biol., 2011, 1-15, retrieved from http://www.thefreelibrary.com//print/PrintArticle.aspx?id=253057768. [all data]
Nance and Setzer, 2011
Nance, M.R.; Setzer, W.N.,
Volatile components of aroma hops (Humulus lupulus L.) commonly used in beer brewing,
J. of Brewing and Distilling, 2011, 2, 2, 16-22. [all data]
Di Giusto, Bessiere, et al., 2010
Di Giusto, B.; Bessiere, J.-M.; Gueroult, M.; Lim, L.B.L.; Marshall, D.J.; Hossaert-McKey, M.; Gaume, L.,
Flower-scent mimicry masks a deadly trap in the carnivorous plant Nepenthes raffesiana,
J. Ecology, 2010, 98, 4, 845-856, https://doi.org/10.1111/j.1365-2745.2010.01665.x
. [all data]
Sharifiar, Yassa, et al., 2010
Sharifiar, F.; Yassa, N.; Mozaffarian, V.,
Bioactivity of major components from the seeds of Bunium persicum (Boiss.) Fedtch,
Pakistan J. Pharm. Sci., 2010, 23, 3, 300-304. [all data]
Courtois, Paine, et al., 2009
Courtois, E.A.; Paine, C.E.; Blandinieres, P.-A.; Stien, D.; Bessiere, J.-M.; Houel, E.; Baraloto, C.; Chave, J.,
Diversity of the volatile organic compounds emitted by 55 species of tropical trees: a survey in French Guiana,
J. Chem. Ecol., 2009, 35, 11, 1349-1362, https://doi.org/10.1007/s10886-009-9718-1
. [all data]
Custer, 2009
Custer, Y.,
GC Volatile Components Analysis of Different Parts of Litchi chinensis (Dissertation), 2009. [all data]
HEuskin, Godin, et al., 2009
HEuskin, S.; Godin, B.; Leroy, P.; Quentin C.; Wathelet, J.-P.; Verheggen, F.; Haubruge, E.; Lognay, G.,
Fast gas chromatography characterization of purified semiochemicals from essential oils of Matricaria chamomilla L. (Asteraceae) and Nepeta cataria L. (Lamiaceae),
J. Chromatorg. A., 2009, 1216, 14, 2768-2775, https://doi.org/10.1016/j.chroma.2008.09.109
. [all data]
Kapoor, Singh, et al., 2009
Kapoor, I.; Singh, B.; Singh, G.; De Heluani, C.S.; De Lampasona, M.P.; Catalan, C.A.N.,
Chemistry and in vitro antioxidant activity of volatile oil and oleoresins of black pepper (Piper nigrum),
J. Agric. Food Chem., 2009, 57, 12, 5358-5364, https://doi.org/10.1021/jf900642x
. [all data]
Mancini, Arnold, et al., 2009
Mancini, E.; Arnold, N.A.; De Martino, L.; De Feo, V.; Formisano, C.; Rigano, D.; Senatore, F.,
Chemical composition and phytotoxic effects of essential oils of Salvia hierosolymitana Boiss. and Salvia multicaulis Vahl. var. simplicifolia Boiss. growing wild in Lebanon,
Molecules, 2009, 14, 11, 4725-4736, https://doi.org/10.3390/molecules14114725
. [all data]
Yang, Yang, et al., 2009
Yang, Z.; Yang, W.; Peng, Q.; He, Q.; Feng, Y.; Luo, S.; Yu, Z.,
Volatile phytochemical composition of rhisome of ginger after extraction by headspace solid-phase microextraction, petrol ether extraction and steam distillation extraction,
Bangladesh J. Pharmacol., 2009, 4, 2, 136-143, https://doi.org/10.3329/bjp.v4i2.3232
. [all data]
Yu, Li, et al., 2009
Yu, L.-F.; Li, X.-R.; Liu, S.-Y.; Xu, G.-W.; Liang, Y.-Z.,
Comparative analysis of essential components between the herbal pair Radix Saposhnikoviae-Rhizoma seu Radix Notopterygii and its single herbs by GC-MS combined with a chemometric resolution method,
Anal. Methods, 2009, 1, 1, 45-51, https://doi.org/10.1039/b9ay00044e
. [all data]
de Albuquerque, Alves, et al., 2008
de Albuquerque, I.L.; Alves, L.A.; Lemos, T.L.G.; Dorneles, C.A.; de Morais, M.O.,
Constituents of the essential oil of Brazilian grenn propolis from Brazil,
J. Essent. Oil Res., 2008, 20, 1-2. [all data]
Costa, De Fina, et al., 2008
Costa, R.; De Fina, M.R.; Valentino, M.R.; Rustaiyan, A.; Dugo, P.; Dugo, G.; Mondello, L.,
An investigation on the volatile composition of some Artemisia species from Iran,
Flavour Fragr. J., 2008, 24, 2, 75-82, https://doi.org/10.1002/ffj.1919
. [all data]
Kupcinskiene, Stikliene, et al., 2008
Kupcinskiene, E.; Stikliene, A.; Judzentiene, A.,
The essential oil guatitative composition in the needles of Pinus sylvestris L. growing along industrial transects,
Environ. Pollution, 2008, 155, 3, 481-491, https://doi.org/10.1016/j.envpol.2008.02.001
. [all data]
Nogueira, Marcelo-Curto, et al., 2008
Nogueira, T.; Marcelo-Curto, M.J.; Cristina Figueiredo, A.; Barroso, J.G.; Pedro, L.G.; Rubiolo, P.; Bicchi, C.,
Chemotaxonomy of Hypericum genus from Portugal: Geographical distribution and essential oils composition of Hypericum perfoliatum, Hypericum humifusum, Hypericum linarifolium and Hypericum pulchrum,
Biochem. Syst. Ecol., 2008, 36, 1, 40-50, https://doi.org/10.1016/j.bse.2007.07.004
. [all data]
Profitt, Schatz, et al., 2008
Profitt, M.; Schatz, B.; Bessiere, J.-M.; Chen, C.; Soler, C.; Hossaert-McKey, M.,
Signalling receptivity: comparison of the emission of volatile compounds by figs of Ficus hispida before, during and after the phase of receptivity to pollinators,
Symbiosis, 2008, 45, 1-10. [all data]
Silva, Doria, et al., 2008
Silva, W.L.; Doria, G.A.A.; Maia, R.T.; Nunes, R.S.; Carvalho, G.A.; Blank, A.F.; Alves, P.B.; Marcal, R.M.; Cavalcanti, S.C.H.,
Effects of essential oils on Aedes aegypti larvae: alternatives to environmentally safe insecticides,
Bioresource Technol., 2008, 99, 8, 3251-3255, https://doi.org/10.1016/j.biortech.2007.05.064
. [all data]
Cole, Haber, et al., 2007
Cole, R.A.; Haber, W.A.; Setzer, W.N.,
Chemical composition of essential oils of seven species of Eugenia from Monteverde, Costa Rica,
Biochem. Syst. Ecol., 2007, 35, 12, 877-886, https://doi.org/10.1016/j.bse.2007.06.013
. [all data]
Eason and Setzer, 2007
Eason, H.M.; Setzer, W.N.,
BArk essential oil composition of Cedrela tinduzii C. DC. (Meliaceae) from Monteverde, Costa Rica,
Rec. NAt. Prod., 2007, 1, 2-3, 24-27. [all data]
Ferreira, Meireles de Sousa, et al., 2007
Ferreira, N.J.; Meireles de Sousa, I.G.; Luís, T.C.; Currais, A.J.M.; Figueiredo, C.; Cost, M.M.; Lima, A.S.B.; Santos, P.A.G.; Barroso, J.G.; Pedro, L.G.; Scheffer, J.J.C.,
Pittosporum undulatum Vent. grown in Portugal: secretory structures, seasonal variation and enantiomeric composition of its essential oil,
Flavour Fragr. J., 2007, 22, 1, 1-9, https://doi.org/10.1002/ffj.1748
. [all data]
Liu, Song, et al., 2007
Liu, L.; Song, G.; Hu, Y.,
GC?MS Analysis of the Essential Oils of Piper nigrum L. and Piper longum L.,
Chromatographia, 2007, 66, 9-10, 785-790, https://doi.org/10.1365/s10337-007-0408-2
. [all data]
Meekijjaroenroj, Bessière, et al., 2007
Meekijjaroenroj, A.; Bessière, J.-M.; Anstett, M.-C.,
Chemistry of floral scents in four Licuala species (Arecaceae),
Flavour Fragr. J., 2007, 22, 4, 300-310, https://doi.org/10.1002/ffj.1797
. [all data]
Moriarity, Bansal, et al., 2007
Moriarity, D.M.; Bansal, A.; Cole, R.A.; Takaku, S.; Haber, W.A.; Setzer, W.N.,
Selective cytotoxic activities of leaf essential oils from Monteverde Costa Rica,
Natural Product Communications, 2007, 2, 12, 1263-1268. [all data]
Proffit, 2007
Proffit, M.,
Mediation chimique et structuration des communautes d'hymenopteres parasites du mutualisme figuier / pollinisateur (These pour obtenir le grade de Docteur de l'Universite Montpellier II) (Dissertation), 2007. [all data]
Setzer, Stokes, et al., 2007
Setzer, W.N.; Stokes, S.L.; Penton, A.F.; Takaku, S.; Haber, W.A.; Hansell, E.; Caffrey, C.R.; McKerrow, J.H.,
Cruzain inhibitory activity of leaf essential oils of neotropical Lauraceae and essential oil components,
Natural Product Communications, 2007, 2, 12, 1203-1210. [all data]
Stokes, Cole, et al., 2007
Stokes, S.L.; Cole, R.A.; Rangelova, M.P.; Haber, W.A.; Setzer, W.N.,
Cruzain inhibitory activity of the leaf essential oil from an undescribed species of Eugenia from Monteverde, Costa Rica,
Natural Product Communications, 2007, 2, 12, 1211-1213. [all data]
Takaku, Haber, et al., 2007
Takaku, S.; Haber, W.A.; Setzer, W.N.,
Leaf essential oil composition of 10 species of Ocotea (Lauraceae) from Monteverde, Costa Rica,
Biochem. Syst. Ecol., 2007, 35, 8, 525-532, https://doi.org/10.1016/j.bse.2007.02.003
. [all data]
Deng, Xu, et al., 2006
Deng, C.; Xu, X.; Yao, N.; Li, N.; Zhang, X.,
Rapid determination of essential oil compounds in Artemisia Selengensis Turcz by gas chromatography-mass spectrometry with microwave distillation and simultaneous solid-phase microextraction,
Anal. Chim. Acta., 2006, 556, 2, 289-294, https://doi.org/10.1016/j.aca.2005.09.038
. [all data]
Judzentiene and Buzelyte, 2006
Judzentiene, A.; Buzelyte, J.,
Chemical composition of essential oils of Artemisia vulgaris L. (mugwort) from North Lithuania,
Chemija, 2006, 17, 1, 12-15. [all data]
Kawaree, Phutdhawong, et al., 2006
Kawaree, R.; Phutdhawong, W.; Picha, P.; Ngamkham, J.,
Chemical compounds, anticancer and antioxidant activities of volatile oil from Piper sarmentosum Roxb., Polyscias fruticosa Harms. and Polygonum odoratum Lour.,
KMITI Sci. J., 2006, 6, 2b, 499-504. [all data]
Li, Deng, et al., 2006
Li, N.; Deng, C.; Li, Y.; Ye, H.; Zhang, X.,
Gas chromatography-mass spectrometry following microwave distillation and headspace solid-phase microextraction for fast analysis of essential oil in dry traditional Chinese medicine,
J. Chromatogr. A, 2006, 1133, 1-2, 29-34, https://doi.org/10.1016/j.chroma.2006.08.046
. [all data]
Schmidt, Noletto, et al., 2006
Schmidt, J.M.; Noletto, J.A.; Vogler, B.; Setzer, W.N.,
Abaco Bush Medicine: Chemical composition of the essential oils of four aromatic medicinal plants from Abaco Island, Bahamas,
J. Herbs, Spices Medicinal Plants, 2006, 12, 3, 43-65, https://doi.org/10.1300/J044v12n03_04
. [all data]
Singh, Marimuthu, et al., 2006
Singh, G.; Marimuthu, P.; de Heluani, C.S.; Catalan, C.A.N.,
Antioxidant and biocidal activities of Carum nigrum (seed) essential oil, oleoresin, and their selected components,
J. Agric. Food Chem., 2006, 54, 1, 174-181, https://doi.org/10.1021/jf0518610
. [all data]
Srivastava, Mallavarapu, et al., 2006
Srivastava, S.; Mallavarapu, G.R.; Rai, S.K.; Singh, D.; Mishra, R.; Pandey-Rai, S.; Kumar, S.,
Composition of the essential oils of the leaves and flowers of Rhus mysurensis Heyne ex Wight Arn growing in the Aravalli mountain range at New Delhi,
Flavour Fragr. J., 2006, 21, 2, 228-229, https://doi.org/10.1002/ffj.1561
. [all data]
Tognolini, Barocelli, et al., 2006
Tognolini, M.; Barocelli, E.; Ballabeni, V.; Bruni, R.; Bianchi, A.; Chiavarini, M.; Impicciatore, M.,
Comparative screening of plant essential oils: Phenylpropanoid moiety as basic core for antiplatelet activity,
Life Sciences, 2006, 78, 13, 1419-1432, https://doi.org/10.1016/j.lfs.2005.07.020
. [all data]
Tuberoso, Barra, et al., 2006
Tuberoso, C.I.G.; Barra, A.; Angioni, A.; Sarritzu, E.; Pirisi, F.M.,
Chemical Composition of Volatiles in Sardinian Myrtle (Myrtus communis L.) Alcoholic Extracts and Essential Oils,
J. Agric. Food Chem., 2006, 54, 4, 1420-1426, https://doi.org/10.1021/jf052425g
. [all data]
Xie, Sun, et al., 2006
Xie, J.; Sun, B.; Yu, M.,
Constituents of top fragrance from fresh flowers of Robinia Pseudoacacia L. occurring in China,
Flavour Fragr. J., 2006, 21, 5, 798-800, https://doi.org/10.1002/ffj.1720
. [all data]
Butkienë, Nivinskienë, et al., 2005
Butkienë, R.; Nivinskienë, O.; Mockutë, D.,
α-Pinene chemotype of leaf (needle) essential oils of Juniperus communis L. growing wild in Vilnius district,
Chemija, 2005, 16, 1, 53-60. [all data]
Cysne, Canuto, et al., 2005
Cysne, J.B.; Canuto, K.M.; Pessoa, O.D.L.; Nunes, E.P.; Silveira, E.R.,
Leaf essential oils of four Piper species from the State of Ceará - Northeast of Brazil,
J. Braz. Chem. Soc., 2005, 16, 6B, 1378-1381, https://doi.org/10.1590/S0103-50532005000800012
. [all data]
Figueiredo, Sim-Sim, et al., 2005
Figueiredo, A.C.; Sim-Sim, M.; Costa, M.M.; Barroso, J.G.; Pedro, L.G.; Esquível, M.G.; Gutierres, F.; Lobo, C.; Fontinha, S.,
Comparison of the essential oil composition of four Plagiochila species: P. bifaria, P. maderensis, P. retrorsa and P. stricta,
Flavour Fragr. J., 2005, 20, 6, 703-709, https://doi.org/10.1002/ffj.1627
. [all data]
Hamm, Bleton, et al., 2005
Hamm, S.; Bleton, J.; Connan, J.; Tchapla, A.,
A chemical investigation by headspace SPME and GC-MS of volatile and semi-volatile terpenes in various olibanum samples,
Phytochemistry, 2005, 66, 12, 1499-1514, https://doi.org/10.1016/j.phytochem.2005.04.025
. [all data]
Pino, Marbot, et al., 2005
Pino, J.A.; Marbot, R.; Rosado, A.; Vázquez, C.,
Volatile constituents of Malay rose apple [Syzygium malaccense (L.) Merr. Perry],
Flavour Fragr. J., 2005, 20, 98-100. [all data]
Albuquerque, Silveira, et al., 2004
Albuquerque, M.R.J.R.; Silveira, E.R.; Uchôa, D.E.A.; Lemos, T.L.G.; Souza, E.B.; Santiago, G.M.P.; Pessoa, O.D.L.,
Chemical composition and larvicidal activity of the essential oils from Eupatorium betonicaeforme (D.C.) Baker (Asteraceae),
J. Agric. Food Chem., 2004, 52, 22, 6708-6711, https://doi.org/10.1021/jf0352881
. [all data]
Butkienë, Nivinskienë, et al., 2004
Butkienë, R.; Nivinskienë, O.; Mockutë, D.,
Chemical composition of unripe and ripe berry essential oils of Juniperus communis L. growing wild in Vilnius district,
Chemija, 2004, 15, 4, 57-63. [all data]
Cavalcanti, de Morais, et al., 2004
Cavalcanti, E.S.B.; de Morais, S.M.; Lima, M.A.A.; Santana, E.W.P.,
Larvicidal activity of essential oils from Brazilian plants against Aedes aegypti L.,
Mem. Inst. Oswaldo Cruz., 2004, 99, 5, 541-544, https://doi.org/10.1590/S0074-02762004000500015
. [all data]
Couladis, Özcan, et al., 2004
Couladis, M.; Özcan, M.; Tzakou, O.; Akgül, A.,
Menengic (Pistacia terebinthus L.) agacinin degisik organlarinda ucucu yag bilesimi, Bitkisel Ilac Hammaddeleri Toplantisi, Bildiriler, 29-31 Mayis 2002, 2004, 6. [all data]
Deng, Li, et al., 2004
Deng, C.; Li, N.; Zhang, X.,
Rapid determination of essential oil in Acorus tatarinowii Schott. by pressurized hot water extraction followed by solid-phase microextraction and gas chromatography-mass spectrometry,
J. Chromatogr. A, 2004, 1059, 1-2, 149-155, https://doi.org/10.1016/j.chroma.2004.10.005
. [all data]
El-Shazly and Hussein, 2004
El-Shazly, A.M.; Hussein, K.T.,
Chemical analysis and biological activities of the essential oil of Teucrium leucocladum Boiss. (Lamiaceae),
Biochem. Syst. Ecol., 2004, 32, 7, 665-674, https://doi.org/10.1016/j.bse.2003.12.009
. [all data]
Hamm, Bleton, et al., 2004
Hamm, S.; Bleton, J.; Tchapla, A.,
Headspace solid phase microextraction for screening for the presence of resins in Egyptian archaeological samples,
J. Sep. Sci., 2004, 27, 3, 235-243, https://doi.org/10.1002/jssc.200301611
. [all data]
Judpentienë and Mockutë, 2004
Judpentienë, A.; Mockutë, D.,
Chemical composition of essential oils of Artemisia absinthium L. (wormwood) growing wild in Vilnius,
Chemija, 2004, 15, 4, 64-68. [all data]
Letchamo, Ward, et al., 2004
Letchamo, W.; Ward, W.; Heard, B.; Heard, D.,
Essential oil of Valeriana officinalis L. cultivars and their antimicrobial activity as influenced by harvesting time under commercial organic cultivation,
J. Agric. Food Chem., 2004, 52, 12, 3915-3919, https://doi.org/10.1021/jf0353990
. [all data]
Senatore, Apostolides Arnold, et al., 2004
Senatore, F.; Apostolides Arnold, N.; Piozzi, F.,
Chemical composition of the essential oil of Salvia multicaulis Vahl. var. simplicifolia Boiss. growing wild in Lebanon,
J. Chromatogr. A, 2004, 1052, 1-2, 237-240, https://doi.org/10.1016/j.chroma.2004.08.095
. [all data]
Silva, Matos, et al., 2004
Silva, M.G. deV.; Matos, F.J. de.A.; Lopes, P.R.O.; Silva, F.O.; Holanda, M.T.,
Composition of Essential Oils from Three Ocimum Species Obtained by Steam and Microwave Distillation and Supercritical CO2 Extraction,
ARKIVOS, 2004, 6, 6, 66-71, https://doi.org/10.3998/ark.5550190.0005.609
. [all data]
Singh, Marimuthu, et al., 2004
Singh, G.; Marimuthu, P.; Catalan, C.; deLampasona, M.P.,
Chemical, antioxidant and antifungal activities of volatile oil of black pepper and its acetone extract,
J. Sci. Food Agric., 2004, 84, 14, 1878-1884, https://doi.org/10.1002/jsfa.1863
. [all data]
Singh, Maurya, et al., 2004
Singh, G.; Maurya, S.; Catalan, C.; de Lampasona, M.P.,
Chemical constituents, antifungal and antioxidative effects of ajwain essential oil and Its acetone extract,
J. Agric. Food Chem., 2004, 52, 11, 3292-3296, https://doi.org/10.1021/jf035211c
. [all data]
Tepe, Donmez, et al., 2004
Tepe, B.; Donmez, E.; Unlu, M.; Candan, F.; Daferera, D.; Vardar-Unlu, G.; Polissiou, M.; Sokmen, A.,
Antimicrobial and antioxidative activities of the essential oils and methanol extracts of Salvia cryptantha (Montbret et Aucher ex Benth.) and Salvia multicaulis (Vahl),
Food Chem., 2004, 84, 4, 519-525, https://doi.org/10.1016/S0308-8146(03)00267-X
. [all data]
Vinogradov, 2004
Vinogradov, B.A.,
Production, composition, properties and application of essential oils, 2004, retrieved from http://viness.narod.ru. [all data]
Hamm, Lesellier, et al., 2003
Hamm, S.; Lesellier, E.; Bleton, J.; Tchapla, A.,
Optimization of headspace solid phase microextraction for gas chromatography/mass spectrometry analysis of widely different volatility and polarity terpenoids in olibanum,
J. Chromatogr. A, 2003, 1018, 1, 73-83, https://doi.org/10.1016/j.chroma.2003.08.027
. [all data]
Mockute, Nivinskiene, et al., 2003
Mockute, D.; Nivinskiene, O.; Bernotiene, G.; Butkiene, R.,
The cis-thujone chemotype of Salvia officinalis L. essential oils,
Chemija, 2003, 14, 4, 216-220. [all data]
Kilic, 2002
Kilic, A.,
Volatile compounds of buds, flowers and fruits of bay (Laurus nobilis L.) and their odour contribution,
Proc. ICNP-2002 - Trabzon/Turkiye, 2002, 338-341. [all data]
Pessoa, Morais, et al., 2002
Pessoa, L.M.; Morais, S.M.; Bevilaqua, C.M.L.; Luciano, J.H.S.,
Anthelmintic activity of essential oil of Ocimum gratissimum Linn. and eugenol against Haemonchus contortus,
Vet. Parasitol., 2002, 109, 1-2, 59-63, https://doi.org/10.1016/S0304-4017(02)00253-4
. [all data]
Schwob, Bessière, et al., 2002, 2
Schwob, I.; Bessière, J.-M.; Dherbomez, M.; Viano, J.,
Composition and antimicrobial activity of the essential oil of Hypericum coris,
Fitoterapia, 2002, 73, 6, 511-513, https://doi.org/10.1016/S0367-326X(02)00171-5
. [all data]
Lermusieau, Bulens, et al., 2001
Lermusieau, G.; Bulens, M.; Collin, S.,
Use of GC-olfactometry to identify the hop aromatic compounds in beer,
J. Agric. Food Chem., 2001, 49, 8, 3867-3874, https://doi.org/10.1021/jf0101509
. [all data]
Andrade, Maia, et al., 2000
Andrade, E.H.A.; Maia, J.G.S.; Zoghbi, M.G.B.,
Aroma volatile constituents of Brazilian varieties of mango fruit,
J. Food Comp. Anal., 2000, 13, 1, 27-33, https://doi.org/10.1006/jfca.1999.0841
. [all data]
Bouwmeester, Wallaart, et al., 1999
Bouwmeester, H.J.; Wallaart, T.E.; Janssen, M.H.A.; van Loo, B.; Jansen, B.J.M.; Posthumus, M.A.; Schmidt, C.O.; de Kraker, J.W.; König, W.A.; Franssen, M.C.R.,
Amorpha-4,11-diene synthase catalyses the first probable step in artemisinin biosynthesis,
Phytochemistry, 1999, 52, 5, 843-854, https://doi.org/10.1016/S0031-9422(99)00206-X
. [all data]
Baratta, Dorman, et al., 1998
Baratta, M.T.; Dorman, H.J.; Deans, S.G.; Figueiredo, A.C.; Barroso, J.G.; Ruberto, G.,
Antimicrobial and antioxidant properties of some commercial essential oils,
Flavour Fragr. J., 1998, 13, 4, 235-244, https://doi.org/10.1002/(SICI)1099-1026(1998070)13:4<235::AID-FFJ733>3.0.CO;2-T
. [all data]
Sanda, Koba, et al., 1998
Sanda, K.; Koba, K.; Nambo, P.; Gaset, A.,
Chemical investigation of Ocimum species growing in Togo,
Flavour Fragr. J., 1998, 13, 4, 226-232, https://doi.org/10.1002/(SICI)1099-1026(1998070)13:4<226::AID-FFJ717>3.0.CO;2-H
. [all data]
da Silva, Figueiredo, et al., 1998
da Silva, J.A.; Figueiredo, A.C.; Barroso, J.G.; Pedro, L.G.; Gomes, M.A.; Fontinha, S.S.; Scheffer, J.J.C.,
Composition of the essential oil of Melanoselinum decipiens (Schrad. Wendl.) Hoffm., an endemic species of the Madeira and Azores archipelagos,
Flavour Fragr. J., 1998, 13, 2, 90-92, https://doi.org/10.1002/(SICI)1099-1026(199803/04)13:2<90::AID-FFJ700>3.0.CO;2-D
. [all data]
Weyerstahl, Marschall, et al., 1998
Weyerstahl, P.; Marschall, H.; Wolf, D.,
Constituents of commercial Brazilian cabore oil,
Flavour Fragr. J., 1998, 13, 2, 85-86, https://doi.org/10.1002/(SICI)1099-1026(199803/04)13:2<85::AID-FFJ697>3.0.CO;2-9
. [all data]
Yusuf, Begum, et al., 1998
Yusuf, M.; Begum, J.; Mondello, L.; Stagno d'Alcontres, I.S.,
Studies on the essential oil bearing plants of Bangladesh. Part VI. Composition of the oil of Ocimum gratissimum L.,
Flavour Fragr. J., 1998, 13, 3, 163-166, https://doi.org/10.1002/(SICI)1099-1026(199805/06)13:3<163::AID-FFJ714>3.0.CO;2-1
. [all data]
Weyerstahl, Marschall, et al., 1997
Weyerstahl, P.; Marschall, H.; Seelmann, I.; Rustaiyan, A.,
Constituents of the essential oil of Achillea eriophora DC,
Flavour Fragr. J., 1997, 12, 2, 71-78, https://doi.org/10.1002/(SICI)1099-1026(199703)12:2<71::AID-FFJ620>3.0.CO;2-E
. [all data]
Zenkevich, 1996
Zenkevich, I.G.,
Analytical Parameters of Components of Essential Oils for their Chromatographic and Chromato-Mass Spectral Identification. Mono- and Sesquiterpenes,
Rastitelnye Resursy (Plant resources), 1996, 34, 1-2, 48-58. [all data]
Feng, Cui, et al., 2011
Feng, T.; Cui, J.-J.; Xiao, Z.-B.; Tian, H.-X.; Yi, F.-P.; Ma, X.,
Chemical composition od essential oil from the peel of Chinese Torreya grandis Frt,
Org. Chem. International, 2011, 2011, 1-5, https://doi.org/10.1155/2011/187372
. [all data]
Tsai, Huang, et al., 2011
Tsai, S.-Y.; Huang, S.-J.; Chyau, C.-C.; Tsai, C.-H.; Weng, C.-C.; Mau, J.-L.,
Composition and antioxidant properties of essential oils from Curcuma rhisome,
Asian J. of Arts Sciences, 2011, 2, 1, 57-66. [all data]
Hymete, Rohloff, et al., 2007
Hymete, A.; Rohloff, J.; Iversen, T.-H.; Kjosen, H.,
Volatile constituents of the roots of Echinops kebericho Mesfin,
Flavour Fragr. J., 2007, 22, 1, 35-38, https://doi.org/10.1002/ffj.1746
. [all data]
Kurose, Okamura, et al., 2007
Kurose, K.; Okamura, D.; Yatagai, M.,
Composition of the essential oils from the leaves of nine Pinus species and the cones of three of Pinus species,
Flavour Fragr. J., 2007, 22, 1, 10-20, https://doi.org/10.1002/ffj.1609
. [all data]
Wei A. and Shibamoto T., 2007
Wei A.; Shibamoto T.,
Antioxidant activities and volatile constituents of various essential oils,
J. Agric. Food Chem., 2007, 55, 5, 1737-1742, https://doi.org/10.1021/jf062959x
. [all data]
Ka, Choi, et al., 2005
Ka, M.-H.; Choi, E.H.; Chun, H.-S.; Lee, K.-G.,
Antioxidative Activity of Volatile Extracts Isolated from Angelica tenuissimae Roots, Peppermint Leaves, Pine Needles, and Sweet Flag Leaves,
J. Agric. Food Chem., 2005, 53, 10, 4124-4129, https://doi.org/10.1021/jf047932x
. [all data]
Jiang and Kubota, 2004
Jiang, L.; Kubota, K.,
Differences in the volatile components and their odor characteristics of green and ripe fruits and dried pericarp of Japanese pepper (Xanthoxylum piperitum DC.),
J. Agric. Food Chem., 2004, 52, 13, 4197-4203, https://doi.org/10.1021/jf030663a
. [all data]
Mau, Lai, et al., 2003
Mau, J.-L.; Lai, E.Y.C.; Wang, N.-P.; Chen, C.-C.; Chang, C.-H.; Chyau, C.-C.,
Composition and antioxidant activity of the essential oil from Curcuma zedoaria,
Food Chem., 2003, 82, 4, 583-591, https://doi.org/10.1016/S0308-8146(03)00014-1
. [all data]
Suleimenov, Atazharova, et al., 2003
Suleimenov, E.M.; Atazharova, G.A.; Demirchi, B.; Baser, K.H.C.; Adekenov, S.M.,
Essential oil composition of Artemisia Lercheana and A. Sieversiana of Kazakhstan flora
in Recent problems of development of new medicines of natural origin, Proceedings of symposium, St.Petersburg - Pushkin, 2003, 382-385. [all data]
Galindo-Cuspinera, Lubran, et al., 2002
Galindo-Cuspinera, V.; Lubran, M.B.; Rankin, S.A.,
Comparison of volatile compounds in water- and oil-soluble annatto (Bixa orellana L.) extracts,
J. Agric. Food Chem., 2002, 50, 7, 2010-2015, https://doi.org/10.1021/jf011325h
. [all data]
Christoph, 2001
Christoph, F.,
Chemische Zuzammensetzung und antimikrobielle Eigenschaften der ätherischen Öle von Leptospermum scoparium J. R. et G. Forst. und anderer Teebaumöle der Gattungen Kunzea, Leptospermum und Melaleuca unter besonderer Berücksichtigung von Handelsölen, Dissertation, University of Hamburg, Germany, 2001, 196. [all data]
Miyazawa, Kurose, et al., 2001
Miyazawa, M.; Kurose, K.; Itoh, A.; Hiraoka, N.,
Comparison of the essential oils of Glehnia littoralis from Northern and Southern Japan,
J. Agric. Food Chem., 2001, 49, 11, 5433-5436, https://doi.org/10.1021/jf010219c
. [all data]
Franco and Shibamoto, 2000
Franco, M.R.B.; Shibamoto, T.,
Volatile composition of some Brazilian fruits: umbu-caja (Spondias citherea), camu-camu (Myrciaria dubia), araca-boi (Eugenia stipitata), and cupuacu (Theobroma grandiflorum),
J. Agric. Food Chem., 2000, 48, 4, 1263-1265, https://doi.org/10.1021/jf9900074
. [all data]
Dunlop, Bignell, et al., 1999
Dunlop, P.J.; Bignell, C.M.; Brooker, M.I.H.; Brophy, J.J.; Hibbert, D.B.,
Use of gas chromatograms of essential leaf oils to compare eight taxa of genus Angophora (Myrtaceae): possible relationships to the genus Eucalyptus,
Biochem. Syst. Ecol., 1999, 27, 8, 815-830, https://doi.org/10.1016/S0305-1978(99)00022-8
. [all data]
Ngassoum, Yonkeu, et al., 1999
Ngassoum, M.B.; Yonkeu, S.; Jirovetz, L.; Buchbauer, G.; Schmaus, G.; Hammerschmidt, F.-J.H.,
Chemical composition of essential oils of Lantana camara leaves and flowers from Cameroon and Madagascar,
Flavour Fragr. J., 1999, 14, 4, 245-250, https://doi.org/10.1002/(SICI)1099-1026(199907/08)14:4<245::AID-FFJ819>3.0.CO;2-X
. [all data]
Bignell, Dunlop, et al., 1998
Bignell, C.M.; Dunlop, P.J.; Brophy, J.J.,
Volatile leaf oils of some South-Western and Southern Australian species of the genus Eucalyptus (Series 1). Part XIX,
Flavour Fragr. J., 1998, 13, 2, 131-139, https://doi.org/10.1002/(SICI)1099-1026(199803/04)13:2<131::AID-FFJ710>3.0.CO;2-X
. [all data]
Tümen, Baser, et al., 1998
Tümen, G.; Baser, K.H.C.; Demirci, B.; Ermin, N.,
The essential oils of Satureja coerulea Janka and Thymus aznavourii Velen.,
Flavour Fragr. J., 1998, 13, 1, 65-67, https://doi.org/10.1002/(SICI)1099-1026(199801/02)13:1<65::AID-FFJ695>3.0.CO;2-Q
. [all data]
Bignell, Dunlop, et al., 1997
Bignell, C.M.; Dunlop, P.J.; Brophy, J.J.; Fookes, C.J.R.,
Volatile leaf oils of some South-Western and Southern Australian species of the genus Eucalyptus (Series I). Part XIV: Subgenus Monocalyptus,
Flavour Fragr. J., 1997, 12, 3, 177-183, https://doi.org/10.1002/(SICI)1099-1026(199705)12:3<177::AID-FFJ626>3.0.CO;2-9
. [all data]
Bignell, Dunlop, et al., 1997, 2
Bignell, C.M.; Dunlop, P.J.; Brophy, J.J.,
Volatile leaf oils of some South-Western and Southern Australian species of the genus Eucalyptus (Series I). Part XV: Subgenus symphyomyrtus, section bisectaria, series levispermae,
Flavour Fragr. J., 1997, 12, 3, 185-193, https://doi.org/10.1002/(SICI)1099-1026(199705)12:3<185::AID-FFJ627>3.0.CO;2-B
. [all data]
Bignell, Dunlop, et al., 1997, 3
Bignell, C.M.; Dunlop, P.J.; Brophy, J.J.,
Volatile leaf oils of some South-Western and Southern Australian species of the genus Eucalyptus (Series I). Part XVI: Subgenus symphyomyrtus, section bisectaria, series cneorifoliae, series porantherae and series falcatae,
Flavour Fragr. J., 1997, 12, 261-267. [all data]
Bignell, Dunlop, et al., 1997, 4
Bignell, C.M.; Dunlop, P.J.; Brophy, J.J.,
Volatile leaf oils of some South-Western and Southern Australian species of the genus Eucalyptus (Series I). Part XVII: Subgenus symphyomyrtus (i) section bisectaria, series calycogonae and (ii) section dumaria, series dumosae, series rigentes and series ovulares,
Flavour Fragr. J., 1997, 12, 269-275. [all data]
Bignell, Dunlop, et al., 1997, 5
Bignell, C.M.; Dunlop, P.J.; Brophy, J.J.,
Volatile leaf oils of some Queensland and Norther Australian species of the genus Eucalyptus (Series II) Part II. Subgenera (a) Blakella, (b) Corymbia, (c) Unnamed, (d) Idiogenes, (e) Monocalyptus and (f) Symphyomyrtus,
Flavour Fragr. J., 1997, 12, 4, 277-284, https://doi.org/10.1002/(SICI)1099-1026(199707)12:4<277::AID-FFJ642>3.0.CO;2-B
. [all data]
Bignell, Dunlop, et al., 1997, 6
Bignell, C.M.; Dunlop, P.J.; Brophy, J.J.,
Volatile leaf oils of some south-western and southern Australian speices of the genus Eucalyptus (Series I). Part XVIII. A. Subgenus monocalyptus. B. Subgenus Symphyomyrtus: (i) section Guilfoyleanae; (ii) section bisectaria, series accedentes, series occidentales, series levispermae, series loxophlebae, series macrocarpae, series orbifoliae, series calycogonae; (iii) section dumaria, series incrassatae and series ovulares,
Flavour Fragr. J., 1997, 12, 423-432. [all data]
Brophy, Goldsack, et al., 1996
Brophy, J.J.; Goldsack, R.J.; Bean, A.R.; Forster, P.I.; Fookes, C.J.R.,
The leaf essential oils of the genus Syncarpia ten. (Myrtaceae),
Flavour Fragr. J., 1996, 11, 6, 361-366, https://doi.org/10.1002/(SICI)1099-1026(199611)11:6<361::AID-FFJ591>3.0.CO;2-T
. [all data]
Shuichi, Masazumi, et al., 1996
Shuichi, H.; Masazumi, N.; Hiromu, K.; Kiyoshi, F.,
Comparison of volatile compounds berween the crude drugs, Onji-tsutsu and Onji-niki,
Nippon nogei kagaku kaishi, 1996, 70, 2, 151-160. [all data]
Gaydou, Faure, et al., 1989
Gaydou, E.M.; Faure, R.; Bianchini, J.-P.; Lamaty, G.; Rakotonirainy, O.; Randriamiharisoa, R.,
Sesquiterpene composition of basil oil. Assignment of the 1H and 13C NMR spectra of β-elemene with two-dimensional NMR,
J. Agric. Food Chem., 1989, 37, 4, 1032-1037, https://doi.org/10.1021/jf00088a048
. [all data]
Takeoka and Butter, 1989
Takeoka, G.; Butter, R.G.,
Volatile constituents of pineapple (Ananas Comosus [L.] Merr.)
in Flavor Chemistry. Trends and Developments, Teranishi,R.; Buttery,R.G.; Shahidi,F., ed(s)., American Chemical Society, Washington, DC, 1989, 223-237. [all data]
Noorizadeh, Farmany, et al., 2011
Noorizadeh, H.; Farmany, A.; Noorizadeh, M.,
Quantitative structure-retention relationships analysis of retention index of essential oils,
Quim. Nova, 2011, 34, 2, 242-249, https://doi.org/10.1590/S0100-40422011000200014
. [all data]
Noorizadeh and Farmany, 2010
Noorizadeh, H.; Farmany, A.,
Exploration of linear and nonlinear modeling techniques to predict of retention index of essential oils,
J. Chin. Chem. Soc., 2010, 1268-1277. [all data]
Baser, Demirci, et al., 2009
Baser, K.H.C.; Demirci, B.; Kurkcuoglu, M.; Satin, F.; Tumen, G.,
Comparative morphological and phytochemical charactertization of Salvia cadmica and S. smyrnaea,
Pak. J. Bot., 2009, 41, 4, 1545-1555. [all data]
Harraca, Syed, et al., 2009
Harraca, V.; Syed, Z.; Guerin, P.M.,
Olfactory and behavioural responces of tsetse flies, Glossina spp., to rumen metabolites,
J. Comp. Physiol. A, 2009, 195, 9, 815-824, https://doi.org/10.1007/s00359-009-0459-y
. [all data]
Quijano and Pino, 2006
Quijano, C.E.; Pino, J.A.,
Changes in volatile constituents during the ripening of cocona (Solanum sessiliflorum Dunal) fruit,
Revista CENIC Ciencias Quimicas, 2006, 37, 3, 133-136. [all data]
Altintas, Kose, et al., 2004
Altintas, A.; Kose, Y.B.; Yucel, E.; Demirci, B.; Baser, K.H.C.,
Composition of the essential oil of Centaurea dichroa,
Chem. Nat. Compd. (Engl. Transl.), 2004, 40, 6, 604-605, https://doi.org/10.1007/s10600-005-0051-9
. [all data]
Baser, Özek, et al., 2004
Baser, K.H.C.; Özek, T.; Kirimer, N.; Deliorman, D.; Ergun, F.,
Composition of the essential oils of Galium aparine L. and Galium odoratum (L.) Scop. from Turkey,
J. Essent. Oil Res., 2004, 16, 4, 305-307, https://doi.org/10.1080/10412905.2004.9698728
. [all data]
Klika, Demirci, et al., 2004
Klika, K.D.; Demirci, B.; Salminen, J.-P.; Ovcharenko, V.V.; Vuorela, S.; Baser, K.H.C.; Pihlaja, K.,
New, Sesquiterpenoid-Type Bicyclic Compounds from the Buds of Betula pubescens -- Ring-Contracted Products of β-Caryophyllene?,
Eur.J.Org.Chem., 2004, 2004, 12, 2627-2635, https://doi.org/10.1002/ejoc.200300808
. [all data]
Baser, Demirci, et al., 2003
Baser, K.H.C.; Demirci, B.; Dekebo, A.; Dagne, E.,
Essential oils of some Boswellia spp., myrrh and opopanax,
Flavour Fragr. J., 2003, 18, 2, 153-156, https://doi.org/10.1002/ffj.1166
. [all data]
Demirci and Baser, 2003
Demirci, B.; Baser, K.H.C.,
Essential oils from the buds of Betula spp. growing in Turkey,
Flavour Fragr. J., 2003, 18, 2, 87-90, https://doi.org/10.1002/ffj.1159
. [all data]
Kaya, Demirci, et al., 2003
Kaya, A.; Demirci, B.; Baser, K.H.C.,
The essential oil of Seseli tortuosum L. growing in Turkey,
Flavour Fragr. J., 2003, 18, 2, 159-161, https://doi.org/10.1002/ffj.1162
. [all data]
Baser, Demirei, et al., 2002
Baser, K.H.C.; Demirei, B.; Özek, T.; Akalin, E.; Özhatay, N.,
Micro-distilled volatile compounds from Ferulago species growing in Western Turkey,
Pharm. Biol., 2002, 40, 6, 466-471, https://doi.org/10.1076/phbi.40.6.466.8439
. [all data]
Baser, Demirci, et al., 2001
Baser, K.H.C.; Demirci, B.; Tabanca, N.; Özek, T.; Gören, N.,
Composition of the essential oils of Tanacetum armenum (DC.) Schultz Bip., T. balsamita L., T. chiliophyllum (Fisch. Mey.) Schultz Bip. var. chiliophyllum and T. haradjani (Rech. fil.) Grierson and the enantiomeric distribution of camphor and carvone,
Flavour Fragr. J., 2001, 16, 3, 195-200, https://doi.org/10.1002/ffj.977
. [all data]
Gören, Demirci, et al., 2001
Gören, N.; Demirci, B.; Baser, K.H.C.,
Composition of the essential oils of Tanacetum spp. from Turkey,
Flavour Fragr. J., 2001, 16, 3, 191-194, https://doi.org/10.1002/ffj.976
. [all data]
Reddy, Angers, et al., 1998
Reddy, M.V.B.; Angers, P.; Gosselin, A.; Arul, J.,
Characterization and use of essential oil from Thymus vulgaris against Botrytis cinerea and Rhizopus stolonifer in strawberry fruits,
Phytochemistry, 1998, 47, 8, 1515-1520, https://doi.org/10.1016/S0031-9422(97)00795-4
. [all data]
Kerrola and Kallio, 1994
Kerrola, K.M.; Kallio, H.P.,
Extraction of volatile compounds of angelica (Angelica archangelica L.) root by liquid carbon dioxide,
J. Agric. Food Chem., 1994, 42, 10, 2235-2245, https://doi.org/10.1021/jf00046a030
. [all data]
Vernin, 1991
Vernin, G.,
Volatile constituents of the essential oil of Santolina chamaecyparissus L.,
J. Essent. Oil Res., 1991, 3, 1, 49-53, https://doi.org/10.1080/10412905.1991.9697907
. [all data]