2-tert-Butyl-4-methyl-6-(a-methylbenzyl)phenol
- Formula: C19H24O
- Molecular weight: 268.3933
- IUPAC Standard InChIKey: KYWXWCOPNNMDMN-UHFFFAOYSA-N
- CAS Registry Number: 1706-65-6
- Chemical structure:

Phase change data

Data compiled as indicated in comments:
TRC - Thermodynamics Research Center, NIST Boulder Laboratories, Chris Muzny director
AC - William E. Acree, Jr., James S. Chickos
Quantity | Value | Units | Method | Reference | Comment |
---|---|---|---|---|---|
Tfus | 338. | K | N/A | Inozemtsev, Liakumovich, et al., 1972 | Uncertainty assigned by TRC = 0.2 K; TRC |
Enthalpy of fusion
ΔfusH (kcal/mol) | Temperature (K) | Method | Reference | Comment |
---|---|---|---|---|
7.500 | 337.7 | DTA | Inozemtsev, Liakumovich, et al., 1972 | AC |

References

Inozemtsev, Liakumovich, et al., 1972
Inozemtsev, P.P.; Liakumovich, A.G.; Gracheva, Z.D.,
Russ. J. Phys. Chem., 1972, 46, 6, 914. [all data]