Tetramethylthiirane
- Formula: C6H12S
- Molecular weight: 116.224
- IUPAC Standard InChIKey: ZAJGXUQFNXGAPA-UHFFFAOYSA-N
- CAS Registry Number: 17066-32-9
- Chemical structure:
View 3d structure (requires JavaScript / HTML 5) - Species with the same structure:

Condensed phase thermochemistry data

Data compiled by: Hussein Y. Afeefy, Joel F. Liebman, and Stephen E. Stein
Quantity | Value | Units | Method | Reference | Comment |
---|---|---|---|---|---|
ΔfH°solid | -83. ± 2. | kJ/mol | Ccr | Sunner, 1963 | |
Quantity | Value | Units | Method | Reference | Comment |
ΔcH°solid | -4595.0 ± 1.5 | kJ/mol | Ccr | Sunner, 1963 |

References

Sunner, 1963
Sunner, S.,
Corrected heat of combustion and formation values for a number of organic sulphur compounds,
Acta Chem. Scand., 1963, 17, 728-730. [all data]