2,5-Dimethylanisole
- Formula: C9H12O
- Molecular weight: 136.1910
- IUPAC Standard InChIKey: SJZAUIVYZWPNAS-UHFFFAOYSA-N
- CAS Registry Number: 1706-11-2
- Chemical structure:
View 3d structure (requires JavaScript / HTML 5) - Other names: Benzene, 2-methoxy-1,4-dimethyl-; Benzene, 1-methoxy-2,5-dimethyl

Phase change data

Data compiled as indicated in comments:
BS - Robert L. Brown and Stephen E. Stein
TRC - Thermodynamics Research Center, NIST Boulder Laboratories, Chris Muzny director
Quantity | Value | Units | Method | Reference | Comment |
---|---|---|---|---|---|
Tboil | 463.2 | K | N/A | Aldrich Chemical Company Inc., 1990 | BS |
Quantity | Value | Units | Method | Reference | Comment |
Tc | 677.4 | K | N/A | Young, 1994 | Uncertainty assigned by TRC = 0.6 K; TRC |

Kovats' RI, non-polar column, isothermal

Column type | Active phase | Temperature (C) | I | Reference | Comment |
---|---|---|---|---|---|
Packed | Apiezon L | 100. | 1106. | Bogoslovsky, Anvaer, et al., 1978 | Chromatone N AW DNCS |
Packed | Apiezon L | 150. | 1120. | Bogoslovsky, Anvaer, et al., 1978 | Chromatone N AW DNCS |

Normal alkane RI, non-polar column, temperature ramp

Column type | Active phase | I | Reference | Comment |
---|---|---|---|---|
Capillary | Ultra-1 | 1091. | Okumura, 1991 | 25. m/0.32 mm/0.25 μm, He, 3. K/min; Tstart: 80. C; Tend: 260. C |

References

Aldrich Chemical Company Inc., 1990
Aldrich Chemical Company Inc.,
Catalog Handbook of Fine Chemicals, Aldrich Chemical Company, Inc., Milwaukee WI, 1990, 1. [all data]
Young, 1994
Young, C.L.,
Personal Commun. 1994 1994, 1994. [all data]
Bogoslovsky, Anvaer, et al., 1978
Bogoslovsky, Yu.N.; Anvaer, B.I.; Vigdergauz, M.S.,
Chromatographic constants in gas chromatography (in Russian), Standards Publ. House, Moscow, 1978, 192. [all data]
Okumura, 1991
Okumura, T.,
retention indices of environmental chemicals on methyl silicone capillary column,
Journal of Environmental Chemistry (Japan), 1991, 1, 2, 333-358, https://doi.org/10.5985/jec.1.333
. [all data]