9-n-propylphenanthrene
- Formula: C17H16
- Molecular weight: 220.3089
- IUPAC Standard InChIKey: PIWHTUVAMGYSIC-UHFFFAOYSA-N
- CAS Registry Number: 17024-03-2
- Chemical structure:
View 3d structure (requires JavaScript / HTML 5) - Other names: Phenanthrene, 9-propyl-

Lee's RI, non-polar column, temperature ramp

Column type | Active phase | I | Reference | Comment |
---|---|---|---|---|
Capillary | SE-52 | 350.30 | Lee, Vassilaros, et al., 1979 | 12. m/0.3 mm/0.34 μm, He, 2. K/min; Tstart: 50. C; Tend: 250. C |

Lee's RI, non-polar column, custom temperature program

Column type | Active phase | I | Reference | Comment |
---|---|---|---|---|
Capillary | SE-52 | 350.30 | Shlyakhov, 1984 | Program: not specified |

References

Lee, Vassilaros, et al., 1979
Lee, M.L.; Vassilaros, D.L.; White, C.M.; Novotny, M.,
Retention Indices for Programmed-Temperature Capillary-Column Gas Chromatography of Polycyclic Aromatic Hydrocarbons,
Anal. Chem., 1979, 51, 6, 768-773, https://doi.org/10.1021/ac50042a043
. [all data]
Shlyakhov, 1984
Shlyakhov, A.F.,
Gas chromatography in organic geochemistry, Nedra, Moscow, 1984, 221. [all data]