dipotassium peroxide
- Formula: K2O2
- Molecular weight: 110.1954
- CAS Registry Number: 17014-71-0

Condensed phase thermochemistry data

Quantity | Value | Units | Method | Reference | Comment |
---|---|---|---|---|---|
ΔfH°solid | -118.50 | kcal/mol | Review | Chase, 1998 | Data last reviewed in September, 1963 |
Quantity | Value | Units | Method | Reference | Comment |
S°solid | 26.991 | cal/mol*K | Review | Chase, 1998 | Data last reviewed in September, 1963 |
Solid Phase Heat Capacity (Shomate Equation)
Cp° = A + B*t + C*t2 + D*t3 +
E/t2
H° − H°298.15= A*t + B*t2/2 +
C*t3/3 + D*t4/4 − E/t + F − H
S° = A*ln(t) + B*t + C*t2/2 + D*t3/3 −
E/(2*t2) + G
Cp = heat capacity (cal/mol*K)
H° = standard enthalpy (kcal/mol)
S° = standard entropy (cal/mol*K)
t = temperature (K) / 1000.
View plot Requires a JavaScript / HTML 5 canvas capable browser.
Temperature (K) | 298. to 2000. |
---|---|
A | 18.91130 |
B | 18.30830 |
C | -2.657990 |
D | 0.566660 |
E | -0.019041 |
F | -124.9960 |
G | 44.42421 |
H | -118.5000 |
Reference | Chase, 1998 |
Comment | Data last reviewed in September, 1963 |

Gas phase ion energetics data

Data compiled as indicated in comments:
RDSH - Henry M. Rosenstock, Keith Draxl, Bruce W. Steiner, and John T. Herron

Ionization energy determinations

IE (eV) Method Reference Comment
~5.EIGusarov and Gorokhov, 1966RDSH

Vibrational and/or electronic energy levels

Data compiled by: Marilyn E. Jacox

State:   X

Vib.
sym.
 No.   Approximate
 type of mode
 cm-1   Med.   Method   References

b2u 5 433.0 Ar IR Andrews, 1971

References

Chase, 1998
Chase, M.W., Jr.,
NIST-JANAF Themochemical Tables, Fourth Edition,
J. Phys. Chem. Ref. Data, Monograph 9, 1998, 1-1951. [all data]