Barbituric acid, 5-ethyl-5-(1-methyl-2-butenyl)-
- Formula: C11H16N2O3
- Molecular weight: 224.2563
- IUPAC Standard InChIKey: PUAFBJFWUGOCOU-GQCTYLIASA-N
- CAS Registry Number: 17013-35-3
- Chemical structure:
View 3d structure (requires JavaScript / HTML 5) - Other names: 2,4,6(1H,3H,5H)-Pyrimidinetrione, 5-ethyl-5-(1-methyl-2-butenyl)-; 5-Ethyl-5-(1-methyl-2-butenyl)barbituric acid; 5-Ethyl-5-(1-methyl-3-butenyl)-hexahydropyrimidin-2,4,6-trione; 5-Ethyl-5-(1-methyl-2-butenyl)-2,4,6(1H,3H,5H)-pyrimidinetrione; Pentobarbital M (OH, -H2O)

Kovats' RI, non-polar column, temperature ramp

Column type | Active phase | I | Reference | Comment |
---|---|---|---|---|
Packed | SE-30 | 1890. | Maurer, 1990 | N2, 100. C @ 3. min, 30. K/min, 310. C @ 5. min |
Packed | SE-30 | 1890. | Maurer, 1990 | N2, 100. C @ 3. min, 30. K/min, 310. C @ 5. min |

References

Maurer, 1990
Maurer, H.H.,
Identification and differentiation of barbiturates, other sedative-hypnotics and their metabolites in urine integrated in a general screening procedure using computerized gas chromatography-mass spectrometry,
J. Chromatogr., 1990, 530, 307-326, https://doi.org/10.1016/S0378-4347(00)82334-8
. [all data]