Fluorodinitrophenylmethane
- Formula: C7H5FN2O4
- Molecular weight: 200.1240
- IUPAC Standard InChIKey: NPRRCIKUIFRPTB-UHFFFAOYSA-N
- CAS Registry Number: 17003-70-2
- Chemical structure:
View 3d structure (requires JavaScript / HTML 5) - Other names: Fluorodinitrophenylethane

Gas phase thermochemistry data

Data compiled as indicated in comments:
ALS - Hussein Y. Afeefy, Joel F. Liebman, and Stephen E. Stein
Quantity | Value | Units | Method | Reference | Comment |
---|---|---|---|---|---|
ΔfH°gas | -70.7 | kJ/mol | Semi | Stewart, 2004 | |
ΔfH°gas | -185. ± 3. | kJ/mol | Ccb | Pepekin, Matyushin, et al., 1972 | ALS |

Condensed phase thermochemistry data

Data compiled by: Hussein Y. Afeefy, Joel F. Liebman, and Stephen E. Stein
Quantity | Value | Units | Method | Reference | Comment |
---|---|---|---|---|---|
ΔfH°liquid | -238. ± 2. | kJ/mol | Ccb | Pepekin, Matyushin, et al., 1972 | |
Quantity | Value | Units | Method | Reference | Comment |
ΔcH°liquid | -3410.8 ± 1.7 | kJ/mol | Ccb | Pepekin, Matyushin, et al., 1972 |

Phase change data

Data compiled as indicated in comments:
ALS - Hussein Y. Afeefy, Joel F. Liebman, and Stephen E. Stein
AC - William E. Acree, Jr., James S. Chickos
Quantity | Value | Units | Method | Reference | Comment |
---|---|---|---|---|---|
ΔvapH° | 52.7 ± 0.8 | kJ/mol | V | Pepekin, Matyushin, et al., 1972 | ALS |
Enthalpy of vaporization
ΔvapH (kJ/mol) | Temperature (K) | Method | Reference | Comment |
---|---|---|---|---|
52.8 | 343. | A | Stephenson and Malanowski, 1987 | Based on data from 328. to 363. K.; AC |

References

Stewart, 2004
Stewart, J.J.P.,
Comparison of the accuracy of semiempirical and some DFT methods for predicting heats of formation,
J. Mol. Model, 2004, 10, 1, 6-10, https://doi.org/10.1007/s00894-003-0157-6
. [all data]
Pepekin, Matyushin, et al., 1972
Pepekin, V.I.; Matyushin, Yu.N.; Rozantsev, G.G.; Shevelev, S.A.; Apin, A.Ya.,
Enthalpies of formation of dinitrophenylmethane, trinitrophenylethane, and fluorodinitrophenylamine,
Bull. Acad. Sci. USSR, Div. Chem. Sci., 1972, 2634-2636. [all data]
Stephenson and Malanowski, 1987
Stephenson, Richard M.; Malanowski, Stanislaw,
Handbook of the Thermodynamics of Organic Compounds, 1987, https://doi.org/10.1007/978-94-009-3173-2
. [all data]