Pyrazon
- Formula: C10H8ClN3O
- Molecular weight: 221.643
- IUPAC Standard InChIKey: WYKYKTKDBLFHCY-UHFFFAOYSA-N
- CAS Registry Number: 1698-60-8
- Chemical structure:
View 3d structure (requires JavaScript / HTML 5) - Other names: 3(2H)-Pyridazinone, 5-amino-4-chloro-2-phenyl-; Burex; HS 119-1; Phenazon; Phenazone; Phenosane; Pyramin; Pyramine; PCA; 1-Phenyl-4-amino-5-chloro-6-oxo-(1H)pyridazine; 5-Amino-4-chloro-2-phenyl-3(2H)-pyridazinone; 5-Amino-4-chloro-2-phenylpyridazin-3(2H)-one; Chloridazon; Chloridazone; Curbetan; PAC; Tripart gladiator; 1-Phenyl-4-amino-5-chloropyridazin-6-one; 1-Phenyl-4-amino-5-chlorpyridaz-6-one; 5-Amino-4-chloro-2,3-dihydro-3-oxo-2-phenylpyridazine; 5-Amino-4-chloro-2-phenyl-3-pyridazinone; BAS 13033; PCA (pesticide); Phenazone (herbicide); Suzon; Betoxon

Phase change data

Data compiled as indicated in comments:
TRC - Thermodynamics Research Center, NIST Boulder Laboratories, Chris Muzny director
AC - William E. Acree, Jr., James S. Chickos
Quantity | Value | Units | Method | Reference | Comment |
---|---|---|---|---|---|
Tfus | 479.38 | K | N/A | Donnelly, Drewes, et al., 1990 | Uncertainty assigned by TRC = 0.2 K; TRC |
Tfus | 480.2 | K | N/A | Plato and Glasgow, 1969 | Uncertainty assigned by TRC = 0.2 K; TRC |
Enthalpy of fusion
ΔfusH (kJ/mol) | Temperature (K) | Method | Reference | Comment |
---|---|---|---|---|
26.75 | 479.2 | DSC | Acree, 1991 | See also Donnelly, Drewes, et al., 1990, 2.; AC |

References

Donnelly, Drewes, et al., 1990
Donnelly, J.R.; Drewes, L.A.; Johnson, R.L.; Munslow, W.D.; Knapp, K.K.; Sovocool, G.W.,
Purity and heat of fusion data for environmental standards as determined by differential scanning calorimetry,
Thermochim. Acta, 1990, 167, 2, 155, https://doi.org/10.1016/0040-6031(90)80476-F
. [all data]
Plato and Glasgow, 1969
Plato, C.; Glasgow, A.R., Jr.,
Differential scanning calorimetry as a general method for determining the purity and heat of fusion of high-purity organic chemicals. Application to 95 compounds,
Anal. Chem., 1969, 41, 2, 330, https://doi.org/10.1021/ac60271a041
. [all data]
Acree, 1991
Acree, William E.,
Thermodynamic properties of organic compounds: enthalpy of fusion and melting point temperature compilation,
Thermochimica Acta, 1991, 189, 1, 37-56, https://doi.org/10.1016/0040-6031(91)87098-H
. [all data]
Donnelly, Drewes, et al., 1990, 2
Donnelly, J.R.; Drewes, L.A.; Johnson, R.L.; Munslow, W.D.; Knapp, K.K.; Sovocool, G.W.,
Purity and heat of fusion data for environmental standards as determined by differential scanning calorimetry,
Thermochimica Acta, 1990, 167, 2, 155-187, https://doi.org/10.1016/0040-6031(90)80476-F
. [all data]