Ethyl nonyl ether
- Formula: C11H24O
- Molecular weight: 172.3077
- IUPAC Standard InChIKey: BCHGIXRCMJWXGE-UHFFFAOYSA-N
- CAS Registry Number: 16979-32-1
- Chemical structure:
View 3d structure (requires JavaScript / HTML 5) - Permanent link for this species. Use this link for bookmarking this species for future reference.

Phase change data

Data compiled by: William E. Acree, Jr., James S. Chickos
Quantity | Value | Units | Method | Reference | Comment |
---|---|---|---|---|---|
ΔvapH° | 60.3 ± 0.1 | kJ/mol | C | Kusano, 1985 |

References

Kusano, 1985
Kusano, Kazuhito,
Micro conduction calorimeters to measure enthalpies of vaporization,
Thermochimica Acta, 1985, 88, 1, 109-120, https://doi.org/10.1016/0040-6031(85)85418-6
. [all data]