Morpholine, 4-acetyl-
- Formula: C6H11NO2
- Molecular weight: 129.1570
- IUPAC Standard InChIKey: KYWXRBNOYGGPIZ-UHFFFAOYSA-N
- CAS Registry Number: 1696-20-4
- Chemical structure:
View 3d structure (requires JavaScript / HTML 5) - Other names: N-Acetylmorpholine; 4-Acetylmorpholine; N-1-Acetyl morpholine; N-Acetylmorfolin

Phase change data

Data compiled by: Robert L. Brown and Stephen E. Stein
Reduced pressure boiling point
Tboil (K) | Pressure (bar) | Reference |
---|---|---|
425.2 | 0.067 | Weast and Grasselli, 1989 |
391.2 | 0.016 | Weast and Grasselli, 1989 |

Van Den Dool and Kratz RI, non-polar column, temperature ramp

Column type | Active phase | I | Reference | Comment |
---|---|---|---|---|
Capillary | DB-1 | 1133. | Johnson, Urso, et al., 1997 | 30. m/0.2 mm/0.25 μm, 50. C @ 2. min, 5. K/min, 300. C @ 5. min |

References

Weast and Grasselli, 1989
CRC Handbook of Data on Organic Compounds, 2nd Editon, Weast,R.C and Grasselli, J.G., ed(s)., CRC Press, Inc., Boca Raton, FL, 1989, 1. [all data]
Johnson, Urso, et al., 1997
Johnson, C.I.; Urso, A.; Geleta, L.,
Broad spectrum analysis of municipal and industrial effluents discharged into the Peace, Athabasca and Slave river basins: characterization of effluent samples, 1994 - Volume 1 of 2, Northern River Basins Study Project Report No. 121, Norther River Basins Study, Edmonton, Alberta, 1997, 27. [all data]