Ethyl bis(trifluoromethyl)phosphinite

Phase change data

Data compiled by: William E. Acree, Jr., James S. Chickos

Enthalpy of vaporization

ΔvapH (kJ/mol) Temperature (K) Reference Comment
33.2288.Emel«65533»us and Smith, 1959Based on data from 248. - 328. K.

References

Emel«65533»us and Smith, 1959
Emel«65533»us, H.J.; Smith, J.D., 67. The heptafluoropropyliodophosphines and their derivatives, J. Chem. Soc., 1959, 375, https://doi.org/10.1039/jr9590000375 . [all data]