1,1,1',1'-Tetrafluorodimethyl ether
- Formula: C2H2F4O
- Molecular weight: 118.0303
- IUPAC Standard InChIKey: IOCGMLSHRBHNCM-UHFFFAOYSA-N
- CAS Registry Number: 1691-17-4
- Chemical structure:
View 3d structure (requires JavaScript / HTML 5) - Other names: (Difluoromethoxy)(difluoro)methane; R E 134; Methane, oxybis(difluoro-

Phase change data

Data compiled by: Thermodynamics Research Center, NIST Boulder Laboratories, Chris Muzny director
Quantity | Value | Units | Method | Reference | Comment |
---|---|---|---|---|---|
Tc | 420.25 | K | N/A | Defibaugh, Gillis, et al., 1992 | Uncertainty assigned by TRC = 0.2 K; from obs. values of refractive index in an optical cell |
Tc | 420.70 | K | N/A | Defibaugh, Gillis, et al., 1992 | Uncertainty assigned by TRC = 1. K; disappearance of the meniscus |
Quantity | Value | Units | Method | Reference | Comment |
Pc | 42.28 | bar | N/A | Defibaugh, Gillis, et al., 1992 | Uncertainty assigned by TRC = 0.80 bar; vapor pressure at Tc |
Quantity | Value | Units | Method | Reference | Comment |
ρc | 4.48 | mol/l | N/A | Defibaugh, Gillis, et al., 1992 | Uncertainty assigned by TRC = 0.10 mol/l; extraplate liq and vapor densities calculated from obs. refractive index to Tc |

Reaction thermochemistry data

Data compiled as indicated in comments:
B - John E. Bartmess
M - Michael M. Meot-Ner (Mautner) and Sharon G. Lias
Individual Reactions
By formula: F- + C2H2F4O = (F- • C2H2F4O)
Quantity | Value | Units | Method | Reference | Comment |
---|---|---|---|---|---|
ΔrH° | 151. ± 8.4 | kJ/mol | IMRE | Larson and McMahon, 1983 | gas phase; These relative affinities are ca. 10 kcal/mol weaker than threshold values (see Wenthold and Squires, 1995) for donors greater than ca. 27 kcal/mol in free energy. This discrepancy has not yet been resolved, though the stronger value appears preferable.; B,M |
Quantity | Value | Units | Method | Reference | Comment |
ΔrS° | 114. | J/mol*K | N/A | Larson and McMahon, 1983 | gas phase; switching reaction(F-)H2O, Entropy change calculated or estimated; Arshadi, Yamdagni, et al., 1970; M |
Quantity | Value | Units | Method | Reference | Comment |
ΔrG° | 118. | kJ/mol | ICR | Larson and McMahon, 1984 | gas phase; switching reaction(F-)SO2F2; M |
ΔrG° | 117. ± 8.4 | kJ/mol | IMRE | Larson and McMahon, 1983 | gas phase; These relative affinities are ca. 10 kcal/mol weaker than threshold values (see Wenthold and Squires, 1995) for donors greater than ca. 27 kcal/mol in free energy. This discrepancy has not yet been resolved, though the stronger value appears preferable.; B,M |
By formula: CN- + C2H2F4O = (CN- • C2H2F4O)
Quantity | Value | Units | Method | Reference | Comment |
---|---|---|---|---|---|
ΔrH° | 92. ± 15. | kJ/mol | IMRE | Larson and McMahon, 1987 | gas phase; B,M |
Quantity | Value | Units | Method | Reference | Comment |
ΔrS° | 110. | J/mol*K | N/A | Larson and McMahon, 1987 | gas phase; switching reaction,Thermochemical ladder(CN-)H2O, Entropy change calculated or estimated; Payzant, Yamdagni, et al., 1971; M |
Quantity | Value | Units | Method | Reference | Comment |
ΔrG° | 63.2 ± 9.6 | kJ/mol | IMRE | Larson and McMahon, 1987 | gas phase; B,M |
By formula: Cl- + C2H2F4O = (Cl- • C2H2F4O)
Quantity | Value | Units | Method | Reference | Comment |
---|---|---|---|---|---|
ΔrH° | 118.0 ± 1.7 | kJ/mol | TDAs | Bogdanov, Lee, et al., 2001 | gas phase; B |
Quantity | Value | Units | Method | Reference | Comment |
ΔrG° | 78.7 ± 4.2 | kJ/mol | TDAs | Bogdanov, Lee, et al., 2001 | gas phase; B |
ΔrG° | 71.1 ± 8.4 | kJ/mol | IMRE | Larson and McMahon, 1984 | gas phase; B,M |
C2H2ClF4O- + 2 = C4H4ClF8O2-
By formula: C2H2ClF4O- + 2C2H2F4O = C4H4ClF8O2-
Quantity | Value | Units | Method | Reference | Comment |
---|---|---|---|---|---|
ΔrH° | 89.5 ± 1.7 | kJ/mol | TDAs | Bogdanov, Lee, et al., 2001 | gas phase; B |
Quantity | Value | Units | Method | Reference | Comment |
ΔrG° | 47.3 ± 4.2 | kJ/mol | TDAs | Bogdanov, Lee, et al., 2001 | gas phase; B |

Ion clustering data

Data compiled as indicated in comments:
B - John E. Bartmess
M - Michael M. Meot-Ner (Mautner) and Sharon G. Lias
Clustering reactions
By formula: CN- + C2H2F4O = (CN- • C2H2F4O)
Quantity | Value | Units | Method | Reference | Comment |
---|---|---|---|---|---|
ΔrH° | 92. ± 15. | kJ/mol | IMRE | Larson and McMahon, 1987 | gas phase; B,M |
Quantity | Value | Units | Method | Reference | Comment |
ΔrS° | 110. | J/mol*K | N/A | Larson and McMahon, 1987 | gas phase; switching reaction,Thermochemical ladder(CN-)H2O, Entropy change calculated or estimated; Payzant, Yamdagni, et al., 1971; M |
Quantity | Value | Units | Method | Reference | Comment |
ΔrG° | 63.2 ± 9.6 | kJ/mol | IMRE | Larson and McMahon, 1987 | gas phase; B,M |
C2H2ClF4O- + 2 = C4H4ClF8O2-
By formula: C2H2ClF4O- + 2C2H2F4O = C4H4ClF8O2-
Quantity | Value | Units | Method | Reference | Comment |
---|---|---|---|---|---|
ΔrH° | 89.5 ± 1.7 | kJ/mol | TDAs | Bogdanov, Lee, et al., 2001 | gas phase; B |
Quantity | Value | Units | Method | Reference | Comment |
ΔrG° | 47.3 ± 4.2 | kJ/mol | TDAs | Bogdanov, Lee, et al., 2001 | gas phase; B |
By formula: Cl- + C2H2F4O = (Cl- • C2H2F4O)
Quantity | Value | Units | Method | Reference | Comment |
---|---|---|---|---|---|
ΔrH° | 118.0 ± 1.7 | kJ/mol | TDAs | Bogdanov, Lee, et al., 2001 | gas phase; B |
Quantity | Value | Units | Method | Reference | Comment |
ΔrG° | 78.7 ± 4.2 | kJ/mol | TDAs | Bogdanov, Lee, et al., 2001 | gas phase; B |
ΔrG° | 71.1 ± 8.4 | kJ/mol | IMRE | Larson and McMahon, 1984 | gas phase; B,M |
By formula: F- + C2H2F4O = (F- • C2H2F4O)
Quantity | Value | Units | Method | Reference | Comment |
---|---|---|---|---|---|
ΔrH° | 151. ± 8.4 | kJ/mol | IMRE | Larson and McMahon, 1983 | gas phase; These relative affinities are ca. 10 kcal/mol weaker than threshold values (see Wenthold and Squires, 1995) for donors greater than ca. 27 kcal/mol in free energy. This discrepancy has not yet been resolved, though the stronger value appears preferable.; B,M |
Quantity | Value | Units | Method | Reference | Comment |
ΔrS° | 114. | J/mol*K | N/A | Larson and McMahon, 1983 | gas phase; switching reaction(F-)H2O, Entropy change calculated or estimated; Arshadi, Yamdagni, et al., 1970; M |
Quantity | Value | Units | Method | Reference | Comment |
ΔrG° | 118. | kJ/mol | ICR | Larson and McMahon, 1984 | gas phase; switching reaction(F-)SO2F2; M |
ΔrG° | 117. ± 8.4 | kJ/mol | IMRE | Larson and McMahon, 1983 | gas phase; These relative affinities are ca. 10 kcal/mol weaker than threshold values (see Wenthold and Squires, 1995) for donors greater than ca. 27 kcal/mol in free energy. This discrepancy has not yet been resolved, though the stronger value appears preferable.; B,M |

References

Defibaugh, Gillis, et al., 1992
Defibaugh, D.R.; Gillis, K.A.; Moldover, M.R.; Morrison, G.; Schmidt, J.W.,
Thermodynamic Properties of CHF2-O-CHF2, Bis(difluoromethyl) Ether,
Fluid Phase Equilib., 1992, 81, 285-305, https://doi.org/10.1016/0378-3812(92)85158-5
. [all data]
Larson and McMahon, 1983
Larson, J.W.; McMahon, T.B.,
Strong hydrogen bonding in gas-phase anions. An ion cyclotron resonance determination of fluoride binding energetics to bronsted acids from gas-phase fluoride exchange equilibria measurements,
J. Am. Chem. Soc., 1983, 105, 2944. [all data]
Wenthold and Squires, 1995
Wenthold, P.G.; Squires, R.R.,
Bond dissociation energies of F2(-) and HF2(-). A gas-phase experimental and G2 theoretical study,
J. Phys. Chem., 1995, 99, 7, 2002, https://doi.org/10.1021/j100007a034
. [all data]
Arshadi, Yamdagni, et al., 1970
Arshadi, M.; Yamdagni, R.; Kebarle, P.,
Hydration of Halide Negative Ions in the Gas Phase. II. Comparison of Hydration Energies for the Alkali Positive and Halide Negative Ions,
J. Phys. Chem., 1970, 74, 7, 1475, https://doi.org/10.1021/j100702a014
. [all data]
Larson and McMahon, 1984
Larson, J.W.; McMahon, T.B.,
Fluoride and chloride affinities of main group oxides, fluorides, oxofluorides, and alkyls. Quantitative scales of lewis acidities from ion cyclotron resonance halide-exchange equilibria,
J. Phys. Chem., 1984, 88, 1083. [all data]
Larson and McMahon, 1987
Larson, J.W.; McMahon, T.B.,
Hydrogen bonding in gas phase anions. The energetics of interaction between cyanide ion and bronsted acids,
J. Am. Chem. Soc., 1987, 109, 6230. [all data]
Payzant, Yamdagni, et al., 1971
Payzant, J.D.; Yamdagni, R.; Kebarle, P.,
Hydration of CN-, NO2-, NO3-, and HO- in the gas phase,
Can. J. Chem., 1971, 49, 3308. [all data]
Bogdanov, Lee, et al., 2001
Bogdanov, B.; Lee, H.J.S.; McMahon, T.B.,
Influence of fluorine substitution on the structures and thermochemistry of chloride ion-ether complexes in the gas phase,
Int. J. Mass Spectrom., 2001, 210, 387-402, https://doi.org/10.1016/S1387-3806(01)00404-3
. [all data]