3,5-Dimethoxycinnamic acid
- Formula: C11H12O4
- Molecular weight: 208.2106
- IUPAC Standard InChIKey: VLSRUFWCGBMYDJ-ONEGZZNKSA-N
- CAS Registry Number: 16909-11-8
- Chemical structure:
View 3d structure (requires JavaScript / HTML 5) - Other names: 2-Propenoic acid, 3-(3,5-dimethoxyphenyl)-; Cinnamic acid, 3,5-dimethoxy-; 3,5-Dimethoxycinnamic acid, predominantly trans; 3',5'-dimethoxycinnamic acid; trans-3,5-dimethoxycinnamic acid

Phase change data

Data compiled by: William E. Acree, Jr., James S. Chickos
Quantity | Value | Units | Method | Reference | Comment |
---|---|---|---|---|---|
ΔsubH° | 141.4 ± 0.5 | kJ/mol | ME | Monte and Hillesheim, 1999 | Based on data from 385. to 397. K. |

Van Den Dool and Kratz RI, non-polar column, custom temperature program

Column type | Active phase | I | Reference | Comment |
---|---|---|---|---|
Capillary | VF-5MS | 1918.3 | Tret'yakov, 2008 | 30. m/0.25 mm/0.25 μm, He; Program: Multi-step temperature program; T(initial)=60C; T(final)=270C |

References

Monte and Hillesheim, 1999
Monte, Manuel J.S.; Hillesheim, Dorothea M.,
Vapour pressures, enthalpies and entropies of sublimation of trans -cinnamic acid and of nine methoxy and dimethoxycinnamic acids,
The Journal of Chemical Thermodynamics, 1999, 31, 11, 1443-1456, https://doi.org/10.1006/jcht.1999.0540
. [all data]
Tret'yakov, 2008
Tret'yakov, K.V.,
Retention Data. NIST Mass Spectrometry Data Center., NIST Mass Spectrometry Data Center, 2008. [all data]