Chlorine anion
- Formula: Cl-
- Molecular weight: 35.454
- IUPAC Standard InChIKey: VEXZGXHMUGYJMC-UHFFFAOYSA-M
- CAS Registry Number: 16887-00-6
- Chemical structure:
- Reaction thermochemistry data: reactions 51 to 100, reactions 101 to 150, reactions 151 to 200, reactions 201 to 250, reactions 251 to 300, reactions 301 to 314

Gas phase thermochemistry data

Quantity | Value | Units | Method | Reference | Comment |
---|---|---|---|---|---|
S°gas,1 bar | 36.654 | cal/mol*K | Review | Chase, 1998 | Data last reviewed in June, 1982 |

Reaction thermochemistry data

Data compiled as indicated in comments:
B - John E. Bartmess
M - Michael M. Meot-Ner (Mautner) and Sharon G. Lias
Reactions 1 to 50
By formula: Cl- + H2O = (Cl- • H2O)
Bond type: Hydrogen bond (negative ion to hydride)
Quantity | Value | Units | Method | Reference | Comment |
---|---|---|---|---|---|
ΔrH° | 15. ± 5. | kcal/mol | AVG | N/A | Average of 11 values; Individual data points |
Quantity | Value | Units | Method | Reference | Comment |
ΔrS° | 19. ± 3. | cal/mol*K | AVG | N/A | Average of 8 values; Individual data points |
Quantity | Value | Units | Method | Reference | Comment |
ΔrG° | 9. ± 4. | kcal/mol | AVG | N/A | Average of 9 values; Individual data points |
By formula: Cl- + CH4O = (Cl- • CH4O)
Quantity | Value | Units | Method | Reference | Comment |
---|---|---|---|---|---|
ΔrH° | 17. ± 3. | kcal/mol | AVG | N/A | Average of 8 values; Individual data points |
Quantity | Value | Units | Method | Reference | Comment |
ΔrS° | 22.6 | cal/mol*K | HPMS | Evans and Keesee, 1991 | gas phase; M |
ΔrS° | 24.1 | cal/mol*K | PHPMS | Hiraoka and Mizuse, 1987 | gas phase; M |
ΔrS° | 22.0 | cal/mol*K | PHPMS | Sieck, 1985 | gas phase; M |
ΔrS° | 22.9 | cal/mol*K | N/A | Larson and McMahon, 1984 | gas phase; switching reaction(Cl-)t-C4H9OH, Entropy change calculated or estimated; French, Ikuta, et al., 1982; M |
ΔrS° | 14.8 | cal/mol*K | PHPMS | Yamdagni, Payzant, et al., 1973 | gas phase; Entropy change is questionable; M |
Quantity | Value | Units | Method | Reference | Comment |
ΔrG° | 10.1 ± 0.8 | kcal/mol | AVG | N/A | Average of 10 values; Individual data points |
By formula: Cl- + HCl = (Cl- • HCl)
Bond type: Hydrogen bond (negative ion to hydride)
Quantity | Value | Units | Method | Reference | Comment |
---|---|---|---|---|---|
ΔrH° | 29.6 ± 1.0 | kcal/mol | N/A | Metz, Kitsopoulos, et al., 1988 | gas phase; Affinity: shift in apparent EA from lesser-solvated ion. Ignores any neutral-neutral bond.; B |
ΔrH° | 23.8 ± 2.0 | kcal/mol | TDEq | Caldwell and Kebarle, 1985 | gas phase; B,M |
ΔrH° | 23.1 ± 2.0 | kcal/mol | IMRE | Larson and McMahon, 1984, 2 | gas phase; B,M |
ΔrH° | 23.70 ± 0.20 | kcal/mol | TDAs | Yamdagni and Kebarle, 1974 | gas phase; B,M |
ΔrH° | 20.4 | kcal/mol | HPMS | Upschulte, Evans, et al., 1986 | gas phase; From thermochemical cycle(Cl-)H2O/HCl, Entropy change calculated or estimated; Keesee and Castleman, 1980; M |
Quantity | Value | Units | Method | Reference | Comment |
ΔrS° | 22.3 | cal/mol*K | PHPMS | Caldwell and Kebarle, 1985 | gas phase; switching reaction(Cl-)SO2; M |
ΔrS° | 23.5 | cal/mol*K | PHPMS | Yamdagni and Kebarle, 1974 | gas phase; M |
ΔrS° | 23.5 | cal/mol*K | N/A | Larson and McMahon, 1984 | gas phase; switching reaction(Cl-)t-C4H9OH, Entropy change calculated or estimated; French, Ikuta, et al., 1982; M |
ΔrS° | 22.8 | cal/mol*K | N/A | Upschulte, Evans, et al., 1986 | gas phase; From thermochemical cycle(Cl-)H2O/HCl, Entropy change calculated or estimated; Keesee and Castleman, 1980; M |
Quantity | Value | Units | Method | Reference | Comment |
ΔrG° | 16.3 ± 2.0 | kcal/mol | IMRE | Larson and McMahon, 1987 | gas phase; K = 0.60 for HCl..Cl- + DCL <=> DCl..Cl- + HCl, anchored to Larson and McMahon, 1984, 32; B |
ΔrG° | 17.1 ± 2.6 | kcal/mol | TDEq | Caldwell and Kebarle, 1985 | gas phase; B |
ΔrG° | 16.0 ± 2.0 | kcal/mol | IMRE | Larson and McMahon, 1984, 2 | gas phase; B,M |
ΔrG° | 16.70 ± 0.30 | kcal/mol | TDAs | Yamdagni and Kebarle, 1974 | gas phase; B |
ΔrG° | 13.6 | kcal/mol | HPMS | Upschulte, Evans, et al., 1986 | gas phase; From thermochemical cycle(Cl-)H2O/HCl, Entropy change calculated or estimated; Keesee and Castleman, 1980; M |
By formula: Cl- + O2S = (Cl- • O2S)
Quantity | Value | Units | Method | Reference | Comment |
---|---|---|---|---|---|
ΔrH° | 22.2 ± 2.0 | kcal/mol | TDAs | Caldwell and Kebarle, 1985 | gas phase; B,M |
ΔrH° | 20.9 ± 2.0 | kcal/mol | IMRE | Larson and McMahon, 1985 | gas phase; B |
ΔrH° | 22.2 ± 2.2 | kcal/mol | TDEq | Bohringer, Fahey, et al., 1984 | gas phase; Relative to HOH..Cl- in Keesee, Lee, et al., 1980; B,M |
ΔrH° | 21.80 ± 0.20 | kcal/mol | TDAs | Keesee, Lee, et al., 1980 | gas phase; B,M |
ΔrH° | 20.9 | kcal/mol | ICR | Larson and McMahon, 1984 | gas phase; switching reaction(Cl-)t-C4H9OH, Entropy change calculated or estimated; French, Ikuta, et al., 1982; M |
Quantity | Value | Units | Method | Reference | Comment |
ΔrS° | 21.6 | cal/mol*K | PHPMS | Caldwell and Kebarle, 1985 | gas phase; M |
ΔrS° | 24.1 | cal/mol*K | N/A | Bohringer, Fahey, et al., 1984 | gas phase; switching reaction(Cl-)H2O), Entropy change calculated or estimated; Keesee and Castleman, 1980; M |
ΔrS° | 20.8 | cal/mol*K | N/A | Larson and McMahon, 1984 | gas phase; switching reaction(Cl-)t-C4H9OH, Entropy change calculated or estimated; French, Ikuta, et al., 1982; M |
ΔrS° | 23.2 | cal/mol*K | HPMS | Keesee, Lee, et al., 1980 | gas phase; M |
Quantity | Value | Units | Method | Reference | Comment |
ΔrG° | 15.7 ± 2.0 | kcal/mol | TDAs | Caldwell and Kebarle, 1985 | gas phase; B |
ΔrG° | 14.7 ± 2.0 | kcal/mol | IMRE | Larson and McMahon, 1985 | gas phase; B |
ΔrG° | 15.0 ± 1.6 | kcal/mol | TDEq | Bohringer, Fahey, et al., 1984 | gas phase; Relative to HOH..Cl- in Keesee, Lee, et al., 1980; B,M |
ΔrG° | 14.80 ± 0.30 | kcal/mol | TDAs | Keesee, Lee, et al., 1980 | gas phase; B |
ΔrG° | 14.7 | kcal/mol | ICR | Larson and McMahon, 1984 | gas phase; switching reaction(Cl-)t-C4H9OH, Entropy change calculated or estimated; French, Ikuta, et al., 1982; M |
Free energy of reaction
ΔrG° (kcal/mol) | T (K) | Method | Reference | Comment |
---|---|---|---|---|
14.2 | 296. | FA | Fehsenfeld and Ferguson, 1974 | gas phase; switching reaction(Cl-)H2O; M |
By formula: Cl- + C6H6 = (Cl- • C6H6)
Quantity | Value | Units | Method | Reference | Comment |
---|---|---|---|---|---|
ΔrH° | 6.00 ± 0.46 | kcal/mol | N/A | Tschurl, Ueberfluss, et al., 2007 | gas phase; B |
ΔrH° | 9.4 ± 2.0 | kcal/mol | TDAs | Hiraoka, Mizuse, et al., 1988 | gas phase; B,M |
ΔrH° | 9.90 | kcal/mol | IMRE | Larson and McMahon, 1984, 2 | gas phase; B,M |
ΔrH° | 8.7 | kcal/mol | PHPMS | Paul and Kebarle, 1991 | gas phase; from Ph. D. thesis of S. Chowdhury, Entropy change calculated or estimated; M |
ΔrH° | 10.4 | kcal/mol | PHPMS | Sunner, Nishizawa, et al., 1981 | gas phase; Entropy change calculated or estimated; M |
Quantity | Value | Units | Method | Reference | Comment |
ΔrS° | 17.9 | cal/mol*K | PHPMS | Hiraoka, Mizuse, et al., 1988 | gas phase; M |
ΔrS° | 17. | cal/mol*K | N/A | Paul and Kebarle, 1991 | gas phase; from Ph. D. thesis of S. Chowdhury, Entropy change calculated or estimated; M |
ΔrS° | 17.1 | cal/mol*K | N/A | Larson and McMahon, 1984 | gas phase; switching reaction(Cl-)t-C4H9OH, Entropy change calculated or estimated; French, Ikuta, et al., 1982; M |
ΔrS° | 22. | cal/mol*K | N/A | Sunner, Nishizawa, et al., 1981 | gas phase; Entropy change calculated or estimated; M |
Quantity | Value | Units | Method | Reference | Comment |
ΔrG° | 4.0 ± 2.6 | kcal/mol | TDAs | Hiraoka, Mizuse, et al., 1988 | gas phase; B |
ΔrG° | 3.8 ± 1.6 | kcal/mol | IMRE | Chowdhury and Kebarle, 1986 | gas phase; B |
ΔrG° | 4.8 ± 2.0 | kcal/mol | IMRE | Larson and McMahon, 1984, 2 | gas phase; B,M |
ΔrG° | 3.80 | kcal/mol | IMRE | French, Ikuta, et al., 1982 | gas phase; B |
Free energy of reaction
ΔrG° (kcal/mol) | T (K) | Method | Reference | Comment |
---|---|---|---|---|
3.6 | 300. | PHPMS | Paul and Kebarle, 1991 | gas phase; from Ph. D. thesis of S. Chowdhury, Entropy change calculated or estimated; M |
3.8 | 300. | PHPMS | Chowdhury and Kebarle, 1986 | gas phase; M |
3.8 | 300. | PHPMS | Sunner, Nishizawa, et al., 1981 | gas phase; Entropy change calculated or estimated; M |
By formula: (Cl- • 2H2O) + H2O = (Cl- • 3H2O)
Bond type: Hydrogen bond (negative ion to hydride)
Quantity | Value | Units | Method | Reference | Comment |
---|---|---|---|---|---|
ΔrH° | 12. ± 2. | kcal/mol | AVG | N/A | Average of 7 values; Individual data points |
Quantity | Value | Units | Method | Reference | Comment |
ΔrS° | 22.3 | cal/mol*K | PHPMS | Hiraoka, Mizuse, et al., 1988, 2 | gas phase; M |
ΔrS° | 22.4 | cal/mol*K | HPMS | Keesee and Castleman, 1980 | gas phase; M |
ΔrS° | 23.2 | cal/mol*K | HPMS | Arshadi, Yamdagni, et al., 1970 | gas phase; M |
Quantity | Value | Units | Method | Reference | Comment |
ΔrG° | 5.0 ± 0.5 | kcal/mol | AVG | N/A | Average of 6 values; Individual data points |
By formula: Cl- + C2H3N = (Cl- • C2H3N)
Quantity | Value | Units | Method | Reference | Comment |
---|---|---|---|---|---|
ΔrH° | 15. ± 2. | kcal/mol | AVG | N/A | Average of 6 values; Individual data points |
Quantity | Value | Units | Method | Reference | Comment |
ΔrS° | 15.7 | cal/mol*K | PHPMS | Hiraoka, Mizuse, et al., 1988, 2 | gas phase; M |
ΔrS° | 15.7 | cal/mol*K | PHPMS | Yamabe, Furumiya, et al., 1986 | gas phase; M |
ΔrS° | 14.3 | cal/mol*K | PHPMS | Sieck, 1985 | gas phase; M |
ΔrS° | 14.3 | cal/mol*K | PHPMS | Yamdagni and Kebarle, 1972 | gas phase; M |
ΔrS° | 21.4 | cal/mol*K | N/A | Larson and McMahon, 1984, 2 | gas phase; switching reaction(Cl-)CF3H, Entropy change calculated or estimated; Larson and McMahon, 1984; M |
Quantity | Value | Units | Method | Reference | Comment |
ΔrG° | 10.20 ± 0.20 | kcal/mol | TDAs | Li, Ross, et al., 1996 | gas phase; B |
ΔrG° | 9.2 ± 2.0 | kcal/mol | TDAs | Hiraoka, Mizuse, et al., 1988, 2 | gas phase; B |
ΔrG° | 8.9 ± 2.6 | kcal/mol | TDAs | Yamabe, Furumiya, et al., 1986 | gas phase; B |
ΔrG° | 10.10 ± 0.20 | kcal/mol | TDAs | Sieck, 1985 | gas phase; B |
ΔrG° | 9.2 ± 2.0 | kcal/mol | TDAs | Yamdagni and Kebarle, 1972 | gas phase; B |
By formula: (Cl- • H2O) + H2O = (Cl- • 2H2O)
Bond type: Hydrogen bond (negative ion to hydride)
Quantity | Value | Units | Method | Reference | Comment |
---|---|---|---|---|---|
ΔrH° | 13. ± 1. | kcal/mol | AVG | N/A | Average of 7 values; Individual data points |
Quantity | Value | Units | Method | Reference | Comment |
ΔrS° | 21.4 | cal/mol*K | PHPMS | Hiraoka, Mizuse, et al., 1988, 2 | gas phase; M |
ΔrS° | 20.5 | cal/mol*K | HPMS | Keesee and Castleman, 1980 | gas phase; M |
ΔrS° | 20.8 | cal/mol*K | HPMS | Arshadi, Yamdagni, et al., 1970 | gas phase; M |
Quantity | Value | Units | Method | Reference | Comment |
ΔrG° | 6.6 ± 1.0 | kcal/mol | TDAs | Hiraoka and Mizuse, 1987 | gas phase; B |
ΔrG° | 6.50 | kcal/mol | TDAs | Keesee and Castleman, 1980 | gas phase; B |
ΔrG° | 6.5 ± 1.4 | kcal/mol | TDAs | Payzant, Yamdagni, et al., 1971 | gas phase; B |
ΔrG° | 6.50 | kcal/mol | TDAs | Arshadi, Yamdagni, et al., 1970 | gas phase; B |
ΔrG° | 6.7 | kcal/mol | FA | Fehsenfeld and Ferguson, 1974 | gas phase; M |
By formula: Cl- + C4H10O = (Cl- • C4H10O)
Quantity | Value | Units | Method | Reference | Comment |
---|---|---|---|---|---|
ΔrH° | 19. ± 4. | kcal/mol | AVG | N/A | Average of 6 values; Individual data points |
Quantity | Value | Units | Method | Reference | Comment |
ΔrS° | 27.4 | cal/mol*K | PHPMS | Hiraoka and Mizuse, 1987 | gas phase; M |
ΔrS° | 24.0 | cal/mol*K | PHPMS | Sieck, 1985 | gas phase; M |
ΔrS° | 23.4 | cal/mol*K | N/A | Larson and McMahon, 1984 | gas phase; Entropy change calculated or estimated; French, Ikuta, et al., 1982; M |
ΔrS° | 27. | cal/mol*K | PHPMS | Kebarle, 1977 | gas phase; M |
ΔrS° | 10.3 | cal/mol*K | N/A | Yamdagni and Kebarle, 1971 | gas phase; Entropy change calculated or estimated; M |
Quantity | Value | Units | Method | Reference | Comment |
ΔrG° | 11.58 | kcal/mol | TDAs | Bogdanov, Peschke, et al., 1999 | gas phase; B |
ΔrG° | 12.30 ± 0.30 | kcal/mol | TDAs | Sieck, 1985 | gas phase; B |
ΔrG° | 11.60 | kcal/mol | TDAs | Hiraoka and Mizuse, 1987 | gas phase; B |
ΔrG° | 11.1 ± 2.0 | kcal/mol | IMRE | Larson and McMahon, 1984, 2 | gas phase; B,M |
ΔrG° | 11.1 ± 2.0 | kcal/mol | TDAs | Yamdagni and Kebarle, 1971 | gas phase; B |
By formula: Cl- + C7H5NO = (Cl- • C7H5NO)
Quantity | Value | Units | Method | Reference | Comment |
---|---|---|---|---|---|
ΔrH° | 35.1 ± 2.0 | kcal/mol | TDEq | Cummings, French, et al., 1977 | gas phase; Re-anchored to data in French, Ikuta, et al., 1982.; B,M,M |
ΔrH° | 35.3 | kcal/mol | PHPMS | Paul and Kebarle, 1990 | gas phase; Entropy change calculated or estimated; M |
Quantity | Value | Units | Method | Reference | Comment |
ΔrS° | 25. | cal/mol*K | N/A | Paul and Kebarle, 1990 | gas phase; Entropy change calculated or estimated; M |
ΔrS° | 28. | cal/mol*K | N/A | Cummings, French, et al., 1977 | gas phase; switching reaction(Cl-)4-Cl-phenol, Entropy change calculated or estimated; French, Ikuta, et al., 1982; M |
ΔrS° | 26. | cal/mol*K | N/A | Cummings, French, et al., 1977 | gas phase; switching reaction(Cl-)4-F-phenol, Entropy change calculated or estimated; French, Ikuta, et al., 1982; M |
Quantity | Value | Units | Method | Reference | Comment |
ΔrG° | 27.3 ± 2.0 | kcal/mol | TDEq | Cummings, French, et al., 1977 | gas phase; Re-anchored to data in French, Ikuta, et al., 1982.; B |
Free energy of reaction
ΔrG° (kcal/mol) | T (K) | Method | Reference | Comment |
---|---|---|---|---|
24.7 | 423. | PHPMS | Paul and Kebarle, 1990 | gas phase; Entropy change calculated or estimated; M |
26.2 | 300. | PHPMS | Cummings, French, et al., 1977 | gas phase; switching reaction(Cl-)4-Cl-phenol, Entropy change calculated or estimated; French, Ikuta, et al., 1982; M |
25.8 | 300. | PHPMS | Cummings, French, et al., 1977 | gas phase; switching reaction(Cl-)4-F-phenol, Entropy change calculated or estimated; French, Ikuta, et al., 1982; M |
By formula: Cl- + C3H6O = (Cl- • C3H6O)
Quantity | Value | Units | Method | Reference | Comment |
---|---|---|---|---|---|
ΔrH° | 14. ± 2. | kcal/mol | AVG | N/A | Average of 6 values; Individual data points |
Quantity | Value | Units | Method | Reference | Comment |
ΔrS° | 18.2 | cal/mol*K | PHPMS | Sieck, 1985 | gas phase; M |
ΔrS° | 19.6 | cal/mol*K | PHPMS | French, Ikuta, et al., 1982 | gas phase; M |
ΔrS° | 17.1 | cal/mol*K | PHPMS | Hiraoka, Takimoto, et al., 1986 | gas phase; M |
ΔrS° | 19.7 | cal/mol*K | N/A | Larson and McMahon, 1984 | gas phase; switching reaction(Cl-)t-C4H9OH, Entropy change calculated or estimated; French, Ikuta, et al., 1982; M |
Quantity | Value | Units | Method | Reference | Comment |
ΔrG° | 8.08 ± 0.20 | kcal/mol | TDAs | Bofdanov and McMahon, 2002 | gas phase; B |
ΔrG° | 7.30 | kcal/mol | TDAs | Hiraoka, Morise, et al., 1986 | gas phase; B |
ΔrG° | 8.80 ± 0.30 | kcal/mol | TDAs | Sieck, 1985 | gas phase; B |
ΔrG° | 8.2 ± 2.0 | kcal/mol | IMRE | Larson and McMahon, 1984, 2 | gas phase; B,M |
ΔrG° | 7.9 ± 2.0 | kcal/mol | TDAs | French, Ikuta, et al., 1982 | gas phase; B |
By formula: Cl- + CHCl3 = (Cl- • CHCl3)
Quantity | Value | Units | Method | Reference | Comment |
---|---|---|---|---|---|
ΔrH° | 15.2 ± 2.0 | kcal/mol | TDAs | Yamdagni and Kebarle, 1971 | gas phase; B,M |
ΔrH° | 19.5 ± 2.0 | kcal/mol | TDAs | Hiraoka, Mizuno, et al., 2001 | gas phase; B |
ΔrH° | 18.10 | kcal/mol | Mobl | Giles and Grimsrud, 1993 | gas phase; B |
ΔrH° | 18.1 ± 2.0 | kcal/mol | IMRE | Larson and McMahon, 1984, 2 | gas phase; B,M |
ΔrH° | 19.10 ± 0.70 | kcal/mol | TDEq | Dougherty, Dalton, et al., 1974 | gas phase; B,M |
Quantity | Value | Units | Method | Reference | Comment |
ΔrS° | 23.2 | cal/mol*K | N/A | Larson and McMahon, 1984, 2 | gas phase; From thermochemical cycle(Cl-)CF3H, Entropy change calculated or estimated; Larson and McMahon, 1984; M |
ΔrS° | 24.5 | cal/mol*K | HPMS | Dougherty, Dalton, et al., 1974 | gas phase; M |
ΔrS° | 14.8 | cal/mol*K | PHPMS | Yamdagni and Kebarle, 1971 | gas phase; Entropy change is questionable; M |
Quantity | Value | Units | Method | Reference | Comment |
ΔrG° | 11. ± 1. | kcal/mol | AVG | N/A | Average of 6 values; Individual data points |
By formula: Cl- + C6H6O = (Cl- • C6H6O)
Quantity | Value | Units | Method | Reference | Comment |
---|---|---|---|---|---|
ΔrH° | 26.0 ± 2.0 | kcal/mol | TDAs | French, Ikuta, et al., 1982 | gas phase; B,M |
ΔrH° | 26.0 ± 2.0 | kcal/mol | TDEq | Cummings, French, et al., 1977 | gas phase; Re-anchored to data in French, Ikuta, et al., 1982.; B |
ΔrH° | 27.4 | kcal/mol | PHPMS | Kebarle, 1977 | gas phase; M |
ΔrH° | 26.5 | kcal/mol | PHPMS | Paul and Kebarle, 1990 | gas phase; Entropy change calculated or estimated; M |
ΔrH° | 19.4 ± 2.0 | kcal/mol | TDAs | Yamdagni and Kebarle, 1971 | gas phase; B,M |
Quantity | Value | Units | Method | Reference | Comment |
ΔrS° | 26.0 | cal/mol*K | PHPMS | French, Ikuta, et al., 1982 | gas phase; M |
ΔrS° | 25. | cal/mol*K | PHPMS | Kebarle, 1977 | gas phase; M |
ΔrS° | 25. | cal/mol*K | N/A | Paul and Kebarle, 1990 | gas phase; Entropy change calculated or estimated; M |
ΔrS° | 15.5 | cal/mol*K | PHPMS | Yamdagni and Kebarle, 1971 | gas phase; M |
Quantity | Value | Units | Method | Reference | Comment |
ΔrG° | 19.2 ± 2.0 | kcal/mol | TDAs | French, Ikuta, et al., 1982 | gas phase; B |
ΔrG° | 18.5 ± 2.0 | kcal/mol | TDEq | Cummings, French, et al., 1977 | gas phase; Re-anchored to data in French, Ikuta, et al., 1982.; B |
ΔrG° | 14.8 ± 2.0 | kcal/mol | TDAs | Yamdagni and Kebarle, 1971 | gas phase; B |
Free energy of reaction
ΔrG° (kcal/mol) | T (K) | Method | Reference | Comment |
---|---|---|---|---|
15.9 | 423. | PHPMS | Paul and Kebarle, 1990 | gas phase; Entropy change calculated or estimated; M |
By formula: Cl- + C6H5Cl = (Cl- • C6H5Cl)
Quantity | Value | Units | Method | Reference | Comment |
---|---|---|---|---|---|
ΔrH° | 12.00 ± 0.10 | kcal/mol | TDAs | Sieck, 1985 | gas phase; B,M |
ΔrH° | 13.6 ± 1.0 | kcal/mol | IMRE | Larson and McMahon, 1984 | gas phase; B,B,M |
ΔrH° | 12.6 | kcal/mol | PHPMS | Paul and Kebarle, 1991 | gas phase; from Ph. D. thesis of S. Chowdhury, Entropy change calculated or estimated; M |
Quantity | Value | Units | Method | Reference | Comment |
ΔrS° | 20. | cal/mol*K | N/A | Paul and Kebarle, 1991 | gas phase; from Ph. D. thesis of S. Chowdhury, Entropy change calculated or estimated; M |
ΔrS° | 16.5 | cal/mol*K | PHPMS | Sieck, 1985 | gas phase; M |
ΔrS° | 22.4 | cal/mol*K | N/A | Larson and McMahon, 1984 | gas phase; switching reaction(Cl-)t-C4H9OH, Entropy change calculated or estimated; French, Ikuta, et al., 1982; M |
Quantity | Value | Units | Method | Reference | Comment |
ΔrG° | 7.10 ± 0.20 | kcal/mol | TDAs | Sieck, 1985 | gas phase; B |
ΔrG° | 6.9 ± 1.0 | kcal/mol | IMRE | Larson and McMahon, 1984 | gas phase; B,B,M |
ΔrG° | 6.50 | kcal/mol | TDEq | French, Ikuta, et al., 1982 | gas phase; B |
Free energy of reaction
ΔrG° (kcal/mol) | T (K) | Method | Reference | Comment |
---|---|---|---|---|
6.6 | 300. | PHPMS | Paul and Kebarle, 1991 | gas phase; from Ph. D. thesis of S. Chowdhury, Entropy change calculated or estimated; M |
6.5 | 300. | PHPMS | French, Ikuta, et al., 1982 | gas phase; M |
By formula: (Cl- • 3H2O) + H2O = (Cl- • 4H2O)
Bond type: Hydrogen bond (negative ion to hydride)
Quantity | Value | Units | Method | Reference | Comment |
---|---|---|---|---|---|
ΔrH° | 10.6 ± 1.0 | kcal/mol | TDAs | Hiraoka and Mizuse, 1987 | gas phase; B |
ΔrH° | 9.70 | kcal/mol | N/A | Markovich, Pollack, et al., 1994 | gas phase; For photodissociation plus electron loss. Affinity is difference from lower solvated ion.; B |
ΔrH° | 10.6 ± 0.3 | kcal/mol | PHPMS | Hiraoka, Mizuse, et al., 1988, 2 | gas phase; M |
ΔrH° | 10.90 ± 0.70 | kcal/mol | TDAs | Keesee and Castleman, 1980 | gas phase; B,M |
ΔrH° | 11.1 ± 1.0 | kcal/mol | TDAs | Arshadi, Yamdagni, et al., 1970 | gas phase; B,M |
Quantity | Value | Units | Method | Reference | Comment |
ΔrS° | 22.7 | cal/mol*K | PHPMS | Hiraoka, Mizuse, et al., 1988, 2 | gas phase; M |
ΔrS° | 24.8 | cal/mol*K | HPMS | Keesee and Castleman, 1980 | gas phase; M |
ΔrS° | 25.8 | cal/mol*K | HPMS | Arshadi, Yamdagni, et al., 1970 | gas phase; M |
Quantity | Value | Units | Method | Reference | Comment |
ΔrG° | 3.8 ± 1.0 | kcal/mol | TDAs | Hiraoka and Mizuse, 1987 | gas phase; B |
ΔrG° | 3.50 | kcal/mol | TDAs | Keesee and Castleman, 1980 | gas phase; B |
ΔrG° | 3.40 | kcal/mol | TDAs | Arshadi, Yamdagni, et al., 1970 | gas phase; B |
ΔrG° | 4.0 ± 2.0 | kcal/mol | TDAs | Kebarle, Arshadi, et al., 1968 | gas phase; B,M |
By formula: Cl- + CH3Cl = (Cl- • CH3Cl)
Quantity | Value | Units | Method | Reference | Comment |
---|---|---|---|---|---|
ΔrH° | 10.4 ± 1.0 | kcal/mol | TDAs | Li, Ross, et al., 1996 | gas phase; B |
ΔrH° | 11.7 ± 2.0 | kcal/mol | TDAs | Hiraoka, Mizuno, et al., 2001 | gas phase; B |
ΔrH° | 12.2 ± 2.0 | kcal/mol | IMRE | Larson and McMahon, 1984, 2 | gas phase; B,M |
ΔrH° | 8.60 ± 0.20 | kcal/mol | TDAs | Dougherty, Dalton, et al., 1974 | gas phase; B,M |
ΔrH° | 15.2 ± 2.0 | kcal/mol | TDAs | Yamdagni and Kebarle, 1971 | gas phase; B |
Quantity | Value | Units | Method | Reference | Comment |
ΔrS° | 20.5 | cal/mol*K | N/A | Larson and McMahon, 1984 | gas phase; switching reaction(Cl-)t-C4H9OH, Entropy change calculated or estimated; French, Ikuta, et al., 1982; M |
ΔrS° | 15.3 | cal/mol*K | HPMS | Dougherty, Dalton, et al., 1974 | gas phase; Entropy change is questionable; M |
Quantity | Value | Units | Method | Reference | Comment |
ΔrG° | 5.80 ± 0.20 | kcal/mol | TDAs | Li, Ross, et al., 1996 | gas phase; B |
ΔrG° | 4.84 | kcal/mol | TDAs | Hiraoka, Mizuno, et al., 2001 | gas phase; B |
ΔrG° | 6.1 ± 2.0 | kcal/mol | IMRE | Larson and McMahon, 1984, 2 | gas phase; B,M |
ΔrG° | 4.10 ± 0.50 | kcal/mol | TDAs | Dougherty, Dalton, et al., 1974 | gas phase; B |
ΔrG° | 10.8 ± 2.0 | kcal/mol | TDAs | Yamdagni and Kebarle, 1971 | gas phase; B |
By formula: Cl- + CH2O2 = (Cl- • CH2O2)
Quantity | Value | Units | Method | Reference | Comment |
---|---|---|---|---|---|
ΔrH° | 27.4 ± 2.0 | kcal/mol | TDAs | French, Ikuta, et al., 1982 | gas phase; B,M |
ΔrH° | 27.7 ± 2.1 | kcal/mol | CIDT | Walker and Sunderlin, 1999 | gas phase; B |
ΔrH° | 25.6 ± 2.0 | kcal/mol | IMRE | Larson and McMahon, 1984, 2 | gas phase; B,M |
ΔrH° | 37.2 ± 2.0 | kcal/mol | TDAs | Yamdagni and Kebarle, 1971 | gas phase; In serious disagreement with other's values. Source of error not obvious.; B,M |
Quantity | Value | Units | Method | Reference | Comment |
ΔrS° | 24.5 | cal/mol*K | PHPMS | French, Ikuta, et al., 1982 | gas phase; M |
ΔrS° | 24.1 | cal/mol*K | N/A | Larson and McMahon, 1984 | gas phase; switching reaction(Cl-)t-C4H9OH, Entropy change calculated or estimated; French, Ikuta, et al., 1982; M |
ΔrS° | 39.6 | cal/mol*K | PHPMS | Yamdagni and Kebarle, 1971 | gas phase; M |
Quantity | Value | Units | Method | Reference | Comment |
ΔrG° | 20.1 ± 2.0 | kcal/mol | TDAs | French, Ikuta, et al., 1982 | gas phase; B |
ΔrG° | 18.4 ± 2.0 | kcal/mol | IMRE | Larson and McMahon, 1984, 2 | gas phase; B,M |
ΔrG° | 25.4 ± 2.0 | kcal/mol | TDAs | Yamdagni and Kebarle, 1971 | gas phase; In serious disagreement with other's values. Source of error not obvious.; B |
By formula: Cl- + C6H5ClO = (Cl- • C6H5ClO)
Quantity | Value | Units | Method | Reference | Comment |
---|---|---|---|---|---|
ΔrH° | 29.6 ± 2.0 | kcal/mol | TDEq | Cummings, French, et al., 1977 | gas phase; Re-anchored to data in French, Ikuta, et al., 1982.; B,M |
ΔrH° | 30.1 | kcal/mol | PHPMS | Paul and Kebarle, 1990 | gas phase; Entropy change calculated or estimated; M |
Quantity | Value | Units | Method | Reference | Comment |
ΔrS° | 25. | cal/mol*K | N/A | Paul and Kebarle, 1990 | gas phase; Entropy change calculated or estimated; M |
ΔrS° | 26.3 | cal/mol*K | N/A | Cummings, French, et al., 1977 | gas phase; switching reaction(Cl-)C6H5OH, Entropy change calculated or estimated; French, Ikuta, et al., 1982; M |
Quantity | Value | Units | Method | Reference | Comment |
ΔrG° | 22.1 ± 2.0 | kcal/mol | TDEq | Cummings, French, et al., 1977 | gas phase; Re-anchored to data in French, Ikuta, et al., 1982.; B |
Free energy of reaction
ΔrG° (kcal/mol) | T (K) | Method | Reference | Comment |
---|---|---|---|---|
19.5 | 423. | PHPMS | Paul and Kebarle, 1990 | gas phase; Entropy change calculated or estimated; M |
21.0 | 300. | PHPMS | Cummings, French, et al., 1977 | gas phase; switching reaction(Cl-)C6H5OH, Entropy change calculated or estimated; French, Ikuta, et al., 1982; M |
By formula: Cl- + C6H5FO = (Cl- • C6H5FO)
Quantity | Value | Units | Method | Reference | Comment |
---|---|---|---|---|---|
ΔrH° | 27.9 ± 2.0 | kcal/mol | TDEq | Cummings, French, et al., 1977 | gas phase; Re-anchored to data in French, Ikuta, et al., 1982.; B,M |
ΔrH° | 28.6 | kcal/mol | PHPMS | Paul and Kebarle, 1990 | gas phase; Entropy change calculated or estimated; M |
Quantity | Value | Units | Method | Reference | Comment |
ΔrS° | 25. | cal/mol*K | N/A | Paul and Kebarle, 1990 | gas phase; Entropy change calculated or estimated; M |
ΔrS° | 25.3 | cal/mol*K | N/A | Cummings, French, et al., 1977 | gas phase; switching reaction(Cl-)C6H5OH, Entropy change calculated or estimated; French, Ikuta, et al., 1982; M |
Quantity | Value | Units | Method | Reference | Comment |
ΔrG° | 20.6 ± 2.0 | kcal/mol | TDEq | Cummings, French, et al., 1977 | gas phase; Re-anchored to data in French, Ikuta, et al., 1982.; B |
Free energy of reaction
ΔrG° (kcal/mol) | T (K) | Method | Reference | Comment |
---|---|---|---|---|
18.0 | 423. | PHPMS | Paul and Kebarle, 1990 | gas phase; Entropy change calculated or estimated; M |
19.3 | 300. | PHPMS | Cummings, French, et al., 1977 | gas phase; switching reaction(Cl-)C6H5OH, Entropy change calculated or estimated; French, Ikuta, et al., 1982; M |
By formula: Cl- + C2H6O = (Cl- • C2H6O)
Quantity | Value | Units | Method | Reference | Comment |
---|---|---|---|---|---|
ΔrH° | 17.90 ± 0.40 | kcal/mol | TDAs | Bogdanov, Peschke, et al., 1999 | gas phase; B |
ΔrH° | 17.60 ± 0.50 | kcal/mol | TDAs | Hiraoka, 1987 | gas phase; B,B,M |
ΔrH° | 17.3 ± 2.0 | kcal/mol | IMRE | Larson and McMahon, 1984, 2 | gas phase; B,M |
Quantity | Value | Units | Method | Reference | Comment |
ΔrS° | 23.7 | cal/mol*K | PHPMS | Hiraoka and Mizuse, 1987 | gas phase; M |
ΔrS° | 23.1 | cal/mol*K | N/A | Larson and McMahon, 1984, 2 | gas phase; switching reaction(Cl-)t-C4H9OH, Entropy change calculated or estimated; Larson and McMahon, 1984; M |
Quantity | Value | Units | Method | Reference | Comment |
ΔrG° | 10.65 | kcal/mol | TDAs | Bogdanov, Peschke, et al., 1999 | gas phase; B |
ΔrG° | 10.5 ± 2.0 | kcal/mol | TDAs | Hiraoka and Mizuse, 1987 | gas phase; B |
ΔrG° | 10.5 ± 2.0 | kcal/mol | TDAs | Hiraoka, 1987 | gas phase; B |
ΔrG° | 10.4 ± 2.0 | kcal/mol | IMRE | Larson and McMahon, 1984, 2 | gas phase; B,M |
Free energy of reaction
ΔrG° (kcal/mol) | T (K) | Method | Reference | Comment |
---|---|---|---|---|
10.0 | 295. | ICR | Riveros, 1974 | gas phase; switching reaction(Cl-)CH3OH; Riveros, Breda, et al., 1973; M |
By formula: (Cl- • CH4O) + CH4O = (Cl- • 2CH4O)
Quantity | Value | Units | Method | Reference | Comment |
---|---|---|---|---|---|
ΔrH° | 14.10 ± 0.40 | kcal/mol | TDAs | Bogdanov, Peschke, et al., 1999 | gas phase; B |
ΔrH° | 13.70 ± 0.20 | kcal/mol | TDAs | Evans and Keesee, 1991 | gas phase; B,M |
ΔrH° | 14.1 ± 1.0 | kcal/mol | TDAs | Hiraoka and Mizuse, 1987 | gas phase; B,M |
ΔrH° | 13.00 ± 0.70 | kcal/mol | TDAs | Yamdagni, Payzant, et al., 1973 | gas phase; B,M |
Quantity | Value | Units | Method | Reference | Comment |
ΔrS° | 24.2 | cal/mol*K | PHPMS | Hiraoka and Mizuse, 1987 | gas phase; M |
ΔrS° | 22.0 | cal/mol*K | HPMS | Evans and Keesee, 1991 | gas phase; M |
ΔrS° | 19.4 | cal/mol*K | PHPMS | Yamdagni, Payzant, et al., 1973 | gas phase; M |
Quantity | Value | Units | Method | Reference | Comment |
ΔrG° | 7.30 | kcal/mol | TDAs | Bogdanov, Peschke, et al., 1999 | gas phase; B |
ΔrG° | 7.10 | kcal/mol | TDAs | Evans and Keesee, 1991 | gas phase; B |
ΔrG° | 6.8 ± 1.0 | kcal/mol | TDAs | Hiraoka and Mizuse, 1987 | gas phase; B |
ΔrG° | 7.20 ± 0.40 | kcal/mol | TDAs | Yamdagni, Payzant, et al., 1973 | gas phase; B |
By formula: (Cl- • 2CH4O) + CH4O = (Cl- • 3CH4O)
Quantity | Value | Units | Method | Reference | Comment |
---|---|---|---|---|---|
ΔrH° | 11.50 ± 0.20 | kcal/mol | TDAs | Bogdanov, Peschke, et al., 1999 | gas phase; B |
ΔrH° | 10.80 ± 0.30 | kcal/mol | TDAs | Evans and Keesee, 1991 | gas phase; B,M |
ΔrH° | 11.8 ± 1.0 | kcal/mol | TDAs | Hiraoka and Mizuse, 1987 | gas phase; B,M |
ΔrH° | 12.30 ± 0.60 | kcal/mol | N/A | Yamdagni, Payzant, et al., 1973 | gas phase; B,M |
Quantity | Value | Units | Method | Reference | Comment |
ΔrS° | 22.9 | cal/mol*K | PHPMS | Hiraoka and Mizuse, 1987 | gas phase; M |
ΔrS° | 22.7 | cal/mol*K | HPMS | Evans and Keesee, 1991 | gas phase; M |
ΔrS° | 23.6 | cal/mol*K | PHPMS | Yamdagni, Payzant, et al., 1973 | gas phase; M |
Quantity | Value | Units | Method | Reference | Comment |
ΔrG° | 5.06 | kcal/mol | TDAs | Bogdanov, Peschke, et al., 1999 | gas phase; B |
ΔrG° | 4.00 | kcal/mol | TDAs | Evans and Keesee, 1991 | gas phase; B |
ΔrG° | 4.9 ± 1.0 | kcal/mol | TDAs | Hiraoka and Mizuse, 1987 | gas phase; B |
ΔrG° | 5.20 ± 0.30 | kcal/mol | TDAs | Yamdagni, Payzant, et al., 1973 | gas phase; B |
By formula: Cl- + C6H5NO2 = (Cl- • C6H5NO2)
Quantity | Value | Units | Method | Reference | Comment |
---|---|---|---|---|---|
ΔrH° | 16.3 ± 1.0 | kcal/mol | TDAs | Chowdhury and Kebarle, 1986 | gas phase; B,M |
ΔrH° | 16.5 | kcal/mol | PHPMS | Paul and Kebarle, 1991 | gas phase; from Ph. D. thesis of S. Chowdhury, Entropy change calculated or estimated; M |
Quantity | Value | Units | Method | Reference | Comment |
ΔrS° | 20. | cal/mol*K | N/A | Paul and Kebarle, 1991 | gas phase; from Ph. D. thesis of S. Chowdhury, Entropy change calculated or estimated; M |
ΔrS° | 19.4 | cal/mol*K | PHPMS | Chowdhury and Kebarle, 1986 | gas phase; M |
Quantity | Value | Units | Method | Reference | Comment |
ΔrG° | 10.5 ± 1.6 | kcal/mol | TDAs | Chowdhury and Kebarle, 1986 | gas phase; B |
ΔrG° | 7.10 | kcal/mol | TDEq | French, Ikuta, et al., 1982 | gas phase; B |
Free energy of reaction
ΔrG° (kcal/mol) | T (K) | Method | Reference | Comment |
---|---|---|---|---|
10.5 | 300. | PHPMS | Paul and Kebarle, 1991 | gas phase; from Ph. D. thesis of S. Chowdhury, Entropy change calculated or estimated; M |
7.7 | 300. | PHPMS | French, Ikuta, et al., 1982 | gas phase; M |
By formula: Cl- + C6H15B = (Cl- • C6H15B)
Quantity | Value | Units | Method | Reference | Comment |
---|---|---|---|---|---|
ΔrH° | 23.8 ± 2.0 | kcal/mol | IMRE | Larson and McMahon, 1985 | gas phase; B,M |
ΔrH° | 23.8 | kcal/mol | ICR | Larson and McMahon, 1984 | gas phase; switching reaction(Cl-)t-C4H9OH, Entropy change calculated or estimated; French, Ikuta, et al., 1982; M |
Quantity | Value | Units | Method | Reference | Comment |
ΔrS° | 22. | cal/mol*K | N/A | Larson and McMahon, 1985 | gas phase; switching reaction,Thermochemical ladder(t-C4H9OH), Entropy change calculated or estimated; M |
ΔrS° | 22.0 | cal/mol*K | N/A | Larson and McMahon, 1984 | gas phase; switching reaction(Cl-)t-C4H9OH, Entropy change calculated or estimated; French, Ikuta, et al., 1982; M |
Quantity | Value | Units | Method | Reference | Comment |
ΔrG° | 17.2 ± 2.0 | kcal/mol | IMRE | Larson and McMahon, 1985 | gas phase; B,M |
ΔrG° | 17.2 | kcal/mol | ICR | Larson and McMahon, 1984 | gas phase; switching reaction(Cl-)t-C4H9OH, Entropy change calculated or estimated; French, Ikuta, et al., 1982; M |
Quantity | Value | Units | Method | Reference | Comment |
---|---|---|---|---|---|
ΔrH° | 333.40 | kcal/mol | N/A | Martin and Hepburn, 1998 | gas phase; Given: ΔHacid(0K)=116288.7±0.6 cm-1, or 332.486±0.002 kcal/mol; B |
ΔrH° | 333.6 ± 2.1 | kcal/mol | G+TS | Fujio, McIver, et al., 1981 | gas phase; value altered from reference due to change in acidity scale; B |
ΔrH° | 329.10 | kcal/mol | N/A | Check, Faust, et al., 2001 | gas phase; FeCC-(q); ; ΔS(EA)=5.0; B |
Quantity | Value | Units | Method | Reference | Comment |
ΔrG° | 328.10 ± 0.10 | kcal/mol | H-TS | Martin and Hepburn, 1998 | gas phase; Given: ΔHacid(0K)=116288.7±0.6 cm-1, or 332.486±0.002 kcal/mol; B |
ΔrG° | 328.3 ± 2.0 | kcal/mol | IMRE | Fujio, McIver, et al., 1981 | gas phase; value altered from reference due to change in acidity scale; B |
ΔrG° | 323.70 | kcal/mol | N/A | Check, Faust, et al., 2001 | gas phase; FeCC-(q); ; ΔS(EA)=5.0; B |
By formula: Cl- + C2H4O2 = (Cl- • C2H4O2)
Quantity | Value | Units | Method | Reference | Comment |
---|---|---|---|---|---|
ΔrH° | 24.40 ± 0.20 | kcal/mol | TDAs | Sieck, 1985 | gas phase; B,M |
ΔrH° | 21.6 ± 2.0 | kcal/mol | TDAs | Yamdagni and Kebarle, 1971 | gas phase; B,M |
ΔrH° | 23.9 ± 2.0 | kcal/mol | IMRE | Larson and McMahon, 1984, 2 | gas phase; B,M |
Quantity | Value | Units | Method | Reference | Comment |
ΔrS° | 19.6 | cal/mol*K | PHPMS | Sieck, 1985 | gas phase; M |
ΔrS° | 24.0 | cal/mol*K | N/A | Larson and McMahon, 1984 | gas phase; switching reaction(Cl-)t-C4H9OH, Entropy change calculated or estimated; French, Ikuta, et al., 1982; M |
ΔrS° | 19.3 | cal/mol*K | PHPMS | Yamdagni and Kebarle, 1971 | gas phase; M |
Quantity | Value | Units | Method | Reference | Comment |
ΔrG° | 18.60 ± 0.30 | kcal/mol | TDAs | Sieck, 1985 | gas phase; B |
ΔrG° | 15.8 ± 2.0 | kcal/mol | TDAs | Yamdagni and Kebarle, 1971 | gas phase; B |
ΔrG° | 16.7 ± 2.0 | kcal/mol | IMRE | Larson and McMahon, 1984, 2 | gas phase; B,M |
By formula: Cl- + H3N = (Cl- • H3N)
Bond type: Hydrogen bond (negative ion to hydride)
Quantity | Value | Units | Method | Reference | Comment |
---|---|---|---|---|---|
ΔrH° | <7.30 ± 0.40 | kcal/mol | N/A | Tschurl and Boesl, 2008 | gas phase; B |
ΔrH° | 8.20 ± 0.10 | kcal/mol | TDAs | Evans, Keesee, et al., 1987 | gas phase; B,M |
ΔrH° | 8.9 ± 1.2 | kcal/mol | N/A | Markovich, Chesnovsky, et al., 1993 | gas phase; B |
ΔrH° | 10.5 ± 4.0 | kcal/mol | IMRE | Larson and McMahon, 1984, 2 | gas phase; B,M |
Quantity | Value | Units | Method | Reference | Comment |
ΔrS° | 15.4 | cal/mol*K | HPMS | Evans, Keesee, et al., 1987 | gas phase; M |
ΔrS° | 19.9 | cal/mol*K | N/A | Larson and McMahon, 1984, 2 | gas phase; switching reaction(Cl-)CH3F, Entropy change calculated or estimated; Larson and McMahon, 1984; M |
Quantity | Value | Units | Method | Reference | Comment |
ΔrG° | 3.60 ± 0.20 | kcal/mol | TDAs | Evans, Keesee, et al., 1987 | gas phase; B |
ΔrG° | 4.5 ± 2.0 | kcal/mol | IMRE | Larson and McMahon, 1984, 2 | gas phase; B,M |
By formula: Cl- + C7H8O = (Cl- • C7H8O)
Quantity | Value | Units | Method | Reference | Comment |
---|---|---|---|---|---|
ΔrH° | 25.6 ± 2.0 | kcal/mol | TDEq | Cummings, French, et al., 1977 | gas phase; Re-anchored to data in French, Ikuta, et al., 1982.; B,M |
ΔrH° | 25.9 | kcal/mol | PHPMS | Paul and Kebarle, 1990 | gas phase; Entropy change calculated or estimated; M |
Quantity | Value | Units | Method | Reference | Comment |
ΔrS° | 25. | cal/mol*K | N/A | Paul and Kebarle, 1990 | gas phase; Entropy change calculated or estimated; M |
ΔrS° | 26.7 | cal/mol*K | PHPMS | Cummings, French, et al., 1977 | gas phase; M |
Quantity | Value | Units | Method | Reference | Comment |
ΔrG° | 17.9 ± 2.0 | kcal/mol | TDEq | Cummings, French, et al., 1977 | gas phase; Re-anchored to data in French, Ikuta, et al., 1982.; B |
Free energy of reaction
ΔrG° (kcal/mol) | T (K) | Method | Reference | Comment |
---|---|---|---|---|
15.3 | 423. | PHPMS | Paul and Kebarle, 1990 | gas phase; Entropy change calculated or estimated; M |
16.6 | 300. | PHPMS | Cummings, French, et al., 1977 | gas phase; M |
By formula: Cl- + C3H8O = (Cl- • C3H8O)
Quantity | Value | Units | Method | Reference | Comment |
---|---|---|---|---|---|
ΔrH° | 19.40 ± 0.20 | kcal/mol | TDAs | Bogdanov, Peschke, et al., 1999 | gas phase; B |
ΔrH° | 18.3 ± 1.0 | kcal/mol | TDAs | Hiraoka and Mizuse, 1987 | gas phase; B,M |
ΔrH° | 17.6 ± 2.0 | kcal/mol | IMRE | Larson and McMahon, 1984, 2 | gas phase; B,M |
Quantity | Value | Units | Method | Reference | Comment |
ΔrS° | 24.7 | cal/mol*K | PHPMS | Hiraoka and Mizuse, 1987 | gas phase; M |
ΔrS° | 23.2 | cal/mol*K | N/A | Larson and McMahon, 1984, 2 | gas phase; switching reaction(cl-)t-C4H9OH, Entropy change calculated or estimated; Larson and McMahon, 1984; M |
Quantity | Value | Units | Method | Reference | Comment |
ΔrG° | 11.32 | kcal/mol | TDAs | Bogdanov, Peschke, et al., 1999 | gas phase; B |
ΔrG° | 10.90 | kcal/mol | TDAs | Hiraoka and Mizuse, 1987 | gas phase; B |
ΔrG° | 10.7 ± 2.0 | kcal/mol | IMRE | Larson and McMahon, 1984, 2 | gas phase; B,M |
By formula: (Cl- • 6H2O) + H2O = (Cl- • 7H2O)
Bond type: Hydrogen bond (negative ion to hydride)
Quantity | Value | Units | Method | Reference | Comment |
---|---|---|---|---|---|
ΔrH° | 8.1 ± 1.0 | kcal/mol | TDAs | Hiraoka and Mizuse, 1987 | gas phase; Estimated entropy; single temperature measurement; B |
ΔrH° | 6.90 | kcal/mol | N/A | Markovich, Pollack, et al., 1994 | gas phase; For photodissociation plus electron loss. Affinity is difference from lower solvated ion.; B |
ΔrH° | 8.1 | kcal/mol | PHPMS | Hiraoka, Mizuse, et al., 1988, 2 | gas phase; Entropy change calculated or estimated; M |
Quantity | Value | Units | Method | Reference | Comment |
ΔrS° | 20. | cal/mol*K | N/A | Hiraoka, Mizuse, et al., 1988, 2 | gas phase; Entropy change calculated or estimated; M |
Quantity | Value | Units | Method | Reference | Comment |
ΔrG° | 2.1 ± 1.0 | kcal/mol | TDAs | Hiraoka and Mizuse, 1987 | gas phase; Estimated entropy; single temperature measurement; B |
By formula: Cl- + CH2Cl2 = (Cl- • CH2Cl2)
Quantity | Value | Units | Method | Reference | Comment |
---|---|---|---|---|---|
ΔrH° | 15.8 ± 2.0 | kcal/mol | IMRE | Larson and McMahon, 1984, 2 | gas phase; B,M |
ΔrH° | 14.8 ± 2.0 | kcal/mol | TDAs | Hiraoka, Mizuno, et al., 2001 | gas phase; B |
ΔrH° | 15.50 ± 0.30 | kcal/mol | TDEq | Dougherty, Dalton, et al., 1974 | gas phase; B,M |
Quantity | Value | Units | Method | Reference | Comment |
ΔrS° | 22.1 | cal/mol*K | N/A | Larson and McMahon, 1984, 2 | gas phase; switching reaction(Cl-)t-C4H9OH, Entropy change calculated or estimated; Kebarle, 1977; M |
ΔrS° | 22.0 | cal/mol*K | HPMS | Dougherty, Dalton, et al., 1974 | gas phase; M |
Quantity | Value | Units | Method | Reference | Comment |
ΔrG° | 9.2 ± 2.0 | kcal/mol | IMRE | Larson and McMahon, 1984, 2 | gas phase; B,M |
ΔrG° | 8.84 | kcal/mol | TDAs | Hiraoka, Mizuno, et al., 2001 | gas phase; B |
ΔrG° | 8.90 ± 0.60 | kcal/mol | TDEq | Dougherty, Dalton, et al., 1974 | gas phase; B |
By formula: Cl- + F3P = (Cl- • F3P)
Quantity | Value | Units | Method | Reference | Comment |
---|---|---|---|---|---|
ΔrH° | 15.5 ± 2.0 | kcal/mol | IMRE | Larson and McMahon, 1985 | gas phase; B |
ΔrH° | 15.5 | kcal/mol | ICR | Larson and McMahon, 1984 | gas phase; switching reaction(Cl-)t-C4H9OH, Entropy change calculated or estimated; French, Ikuta, et al., 1982; M |
Quantity | Value | Units | Method | Reference | Comment |
ΔrS° | 21.0 | cal/mol*K | N/A | Larson and McMahon, 1984 | gas phase; switching reaction(Cl-)t-C4H9OH, Entropy change calculated or estimated; French, Ikuta, et al., 1982; M |
Quantity | Value | Units | Method | Reference | Comment |
ΔrG° | 9.2 ± 2.0 | kcal/mol | IMRE | Larson and McMahon, 1985 | gas phase; B |
ΔrG° | 9.2 | kcal/mol | ICR | Larson and McMahon, 1984 | gas phase; switching reaction(Cl-)t-C4H9OH, Entropy change calculated or estimated; French, Ikuta, et al., 1982; M |
By formula: Cl- + C3H8O = (Cl- • C3H8O)
Quantity | Value | Units | Method | Reference | Comment |
---|---|---|---|---|---|
ΔrH° | 20.40 ± 0.50 | kcal/mol | TDAs | Hiraoka, 1987 | gas phase; B,B,M |
ΔrH° | 17.7 ± 2.0 | kcal/mol | IMRE | Larson and McMahon, 1984, 2 | gas phase; B,M |
Quantity | Value | Units | Method | Reference | Comment |
ΔrS° | 29.0 | cal/mol*K | PHPMS | Hiraoka and Mizuse, 1987 | gas phase; M |
ΔrS° | 23.2 | cal/mol*K | N/A | Larson and McMahon, 1984, 2 | gas phase; switching reaction(Cl-)t-C4H9OH, Entropy change calculated or estimated; Larson and McMahon, 1984; M |
Quantity | Value | Units | Method | Reference | Comment |
ΔrG° | 11.70 | kcal/mol | TDAs | Hiraoka and Mizuse, 1987 | gas phase; B |
ΔrG° | 11.7 ± 2.0 | kcal/mol | TDAs | Hiraoka, 1987 | gas phase; B |
ΔrG° | 10.8 ± 2.0 | kcal/mol | IMRE | Larson and McMahon, 1984, 2 | gas phase; B,M |
By formula: Cl- + CHN = (Cl- • CHN)
Quantity | Value | Units | Method | Reference | Comment |
---|---|---|---|---|---|
ΔrH° | 21.8 ± 1.0 | kcal/mol | TDAs | Meot-ner, 1988 | gas phase; B,B,M |
ΔrH° | 21.0 ± 2.0 | kcal/mol | IMRE | Larson and McMahon, 1984, 2 | gas phase; B,M |
Quantity | Value | Units | Method | Reference | Comment |
ΔrS° | 18.9 | cal/mol*K | PHPMS | Meot-ner, Cybulski, et al., 1988 | gas phase; M |
ΔrS° | 23.7 | cal/mol*K | N/A | Larson and McMahon, 1984 | gas phase; switching reaction(Cl-)t-C4H9OH, Entropy change calculated or estimated; French, Ikuta, et al., 1982; M |
Quantity | Value | Units | Method | Reference | Comment |
ΔrG° | 16.2 ± 1.6 | kcal/mol | TDAs | Meot-ner, Cybulski, et al., 1988 | gas phase; B |
ΔrG° | 16.1 ± 1.0 | kcal/mol | TDAs | Meot-ner, 1988 | gas phase; B |
ΔrG° | 13.9 ± 2.0 | kcal/mol | IMRE | Larson and McMahon, 1984, 2 | gas phase; B,M |
By formula: Cl- + CO2 = (Cl- • CO2)
Quantity | Value | Units | Method | Reference | Comment |
---|---|---|---|---|---|
ΔrH° | 6.80 ± 0.50 | kcal/mol | PDis | Arnold, Bradforth, et al., 1995 | gas phase; Affinity: shift in apparent EA from lesser-solvated ion. Ignores any neutral-neutral bond.; B |
ΔrH° | 7.60 | kcal/mol | TDEq | Hiraoka, Shoda, et al., 1986 | gas phase; B,M |
ΔrH° | 8.00 ± 0.10 | kcal/mol | TDAs | Keesee, Lee, et al., 1980 | gas phase; B,M |
Quantity | Value | Units | Method | Reference | Comment |
ΔrS° | 18.2 | cal/mol*K | PHPMS | Hiraoka, Shoda, et al., 1986 | gas phase; M |
ΔrS° | 19.6 | cal/mol*K | HPMS | Keesee, Lee, et al., 1980 | gas phase; M |
Quantity | Value | Units | Method | Reference | Comment |
ΔrG° | 2.10 | kcal/mol | TDEq | Hiraoka, Shoda, et al., 1986 | gas phase; B |
ΔrG° | 2.10 ± 0.10 | kcal/mol | TDAs | Keesee, Lee, et al., 1980 | gas phase; B |
By formula: (Cl- • 3CH4O) + CH4O = (Cl- • 4CH4O)
Quantity | Value | Units | Method | Reference | Comment |
---|---|---|---|---|---|
ΔrH° | 10.5 ± 1.0 | kcal/mol | TDAs | Hiraoka and Mizuse, 1987 | gas phase; B,M |
ΔrH° | 10.50 | kcal/mol | TDAs | Evans and Keesee, 1991 | gas phase; B |
ΔrH° | 11.20 ± 0.60 | kcal/mol | TDAs | Yamdagni, Payzant, et al., 1973 | gas phase; B,M |
Quantity | Value | Units | Method | Reference | Comment |
ΔrS° | 22.9 | cal/mol*K | PHPMS | Hiraoka and Mizuse, 1987 | gas phase; M |
ΔrS° | 26.4 | cal/mol*K | PHPMS | Yamdagni, Payzant, et al., 1973 | gas phase; M |
Quantity | Value | Units | Method | Reference | Comment |
ΔrG° | 3.6 ± 1.0 | kcal/mol | TDAs | Hiraoka and Mizuse, 1987 | gas phase; B |
ΔrG° | 3.70 | kcal/mol | TDAs | Evans and Keesee, 1991 | gas phase; B |
ΔrG° | 3.30 ± 0.20 | kcal/mol | TDAs | Yamdagni, Payzant, et al., 1973 | gas phase; B |
By formula: (Cl- • 4H2O) + H2O = (Cl- • 5H2O)
Bond type: Hydrogen bond (negative ion to hydride)
Quantity | Value | Units | Method | Reference | Comment |
---|---|---|---|---|---|
ΔrH° | 9.5 ± 1.0 | kcal/mol | TDAs | Hiraoka and Mizuse, 1987 | gas phase; B |
ΔrH° | 6.70 | kcal/mol | N/A | Markovich, Pollack, et al., 1994 | gas phase; For photodissociation plus electron loss. Affinity is difference from lower solvated ion.; B |
ΔrH° | 9.5 ± 0.3 | kcal/mol | PHPMS | Hiraoka, Mizuse, et al., 1988, 2 | gas phase; M |
Quantity | Value | Units | Method | Reference | Comment |
ΔrS° | 21.7 | cal/mol*K | PHPMS | Hiraoka, Mizuse, et al., 1988, 2 | gas phase; M |
Quantity | Value | Units | Method | Reference | Comment |
ΔrG° | 3.0 ± 1.0 | kcal/mol | TDAs | Hiraoka and Mizuse, 1987 | gas phase; B |
ΔrG° | 2.9 ± 2.0 | kcal/mol | TDAs | Kebarle, Arshadi, et al., 1968 | gas phase; B,M |
By formula: Cl- + C3F6O = (Cl- • C3F6O)
Quantity | Value | Units | Method | Reference | Comment |
---|---|---|---|---|---|
ΔrH° | 28.8 ± 1.0 | kcal/mol | TDAs | Bofdanov and McMahon, 2002 | gas phase; B |
ΔrH° | 22.9 ± 2.0 | kcal/mol | IMRE | Larson and McMahon, 1985 | gas phase; B,M |
Quantity | Value | Units | Method | Reference | Comment |
ΔrS° | 22. | cal/mol*K | N/A | Larson and McMahon, 1985 | gas phase; switching reaction,Thermochemical ladder(t-C4H9OH), Entropy change calculated or estimated; M |
Quantity | Value | Units | Method | Reference | Comment |
ΔrG° | 17.6 ± 1.0 | kcal/mol | TDAs | Bofdanov and McMahon, 2002 | gas phase; B |
ΔrG° | 16.3 ± 2.0 | kcal/mol | IMRE | Larson and McMahon, 1985 | gas phase; B,M |
ΔrG° | 16.3 | kcal/mol | ICR | Larson and McMahon, 1984, 3 | gas phase; switching reaction(Cl-)(C2H5)3B; M |
By formula: (Cl- • 3C2H3N) + C2H3N = (Cl- • 4C2H3N)
Quantity | Value | Units | Method | Reference | Comment |
---|---|---|---|---|---|
ΔrH° | 10.90 ± 0.30 | kcal/mol | TDAs | Hiraoka, Mizuse, et al., 1988, 2 | gas phase; B,M |
ΔrH° | 9.00 ± 0.80 | kcal/mol | N/A | Markovich, Perera, et al., 1996 | gas phase; B |
ΔrH° | 6.20 | kcal/mol | TDAs | Yamdagni and Kebarle, 1972 | gas phase; B,M |
Quantity | Value | Units | Method | Reference | Comment |
ΔrS° | 26.6 | cal/mol*K | PHPMS | Hiraoka, Mizuse, et al., 1988, 2 | gas phase; M |
ΔrS° | 10.8 | cal/mol*K | PHPMS | Yamdagni and Kebarle, 1972 | gas phase; Entropy change is questionable; M |
Quantity | Value | Units | Method | Reference | Comment |
ΔrG° | 2.9 ± 1.2 | kcal/mol | TDAs | Hiraoka, Mizuse, et al., 1988, 2 | gas phase; B |
ΔrG° | 3.00 | kcal/mol | TDAs | Yamdagni and Kebarle, 1972 | gas phase; B |
By formula: Cl- + C3HF5O = (Cl- • C3HF5O)
Quantity | Value | Units | Method | Reference | Comment |
---|---|---|---|---|---|
ΔrH° | 26.1 ± 1.0 | kcal/mol | TDAs | Bofdanov and McMahon, 2002 | gas phase; B |
ΔrH° | 23.4 | kcal/mol | ICR | Larson and McMahon, 1984 | gas phase; switching reaction(Cl-)t-C4H9OH, Entropy change calculated or estimated; French, Ikuta, et al., 1982; M |
Quantity | Value | Units | Method | Reference | Comment |
ΔrS° | 23.9 | cal/mol*K | N/A | Larson and McMahon, 1984 | gas phase; switching reaction(Cl-)t-C4H9OH, Entropy change calculated or estimated; French, Ikuta, et al., 1982; M |
Quantity | Value | Units | Method | Reference | Comment |
ΔrG° | 17.2 ± 1.0 | kcal/mol | TDAs | Bofdanov and McMahon, 2002 | gas phase; B |
ΔrG° | 16.3 ± 2.0 | kcal/mol | IMRE | Larson and McMahon, 1984, 3 | gas phase; B,M,M |
By formula: Cl- + C3H2F6O = (Cl- • C3H2F6O)
Quantity | Value | Units | Method | Reference | Comment |
---|---|---|---|---|---|
ΔrH° | 26.5 | kcal/mol | ICR | Larson and McMahon, 1984, 2 | gas phase; switching reaction(Cl-)(CF3)2CH3COH, Entropy change calculated or estimated, DG>, ΔrH>; Larson and McMahon, 1984; M |
Quantity | Value | Units | Method | Reference | Comment |
ΔrS° | 25.0 | cal/mol*K | N/A | Larson and McMahon, 1984, 2 | gas phase; switching reaction(Cl-)(CF3)2CH3COH, Entropy change calculated or estimated, DG>, ΔrH>; Larson and McMahon, 1984; M |
Quantity | Value | Units | Method | Reference | Comment |
ΔrG° | 19.0 | kcal/mol | ICR | Larson and McMahon, 1984, 2 | gas phase; switching reaction(Cl-)(CF3)2CH3COH, Entropy change calculated or estimated, DG>, ΔrH>; Larson and McMahon, 1984; M |
By formula: (Cl- • 2C2H3N) + C2H3N = (Cl- • 3C2H3N)
Quantity | Value | Units | Method | Reference | Comment |
---|---|---|---|---|---|
ΔrH° | 11.20 ± 0.40 | kcal/mol | TDAs | Hiraoka, Mizuse, et al., 1988, 2 | gas phase; B,M |
ΔrH° | 12.00 ± 0.70 | kcal/mol | N/A | Markovich, Perera, et al., 1996 | gas phase; B |
ΔrH° | 10.60 | kcal/mol | TDAs | Yamdagni and Kebarle, 1972 | gas phase; B,M |
Quantity | Value | Units | Method | Reference | Comment |
ΔrS° | 19.6 | cal/mol*K | PHPMS | Hiraoka, Mizuse, et al., 1988, 2 | gas phase; M |
ΔrS° | 20.1 | cal/mol*K | PHPMS | Yamdagni and Kebarle, 1972 | gas phase; M |
Quantity | Value | Units | Method | Reference | Comment |
ΔrG° | 5.3 ± 1.3 | kcal/mol | TDAs | Hiraoka, Mizuse, et al., 1988, 2 | gas phase; B |
ΔrG° | 4.60 | kcal/mol | TDAs | Yamdagni and Kebarle, 1972 | gas phase; B |
By formula: Cl- + CS2 = (Cl- • CS2)
Quantity | Value | Units | Method | Reference | Comment |
---|---|---|---|---|---|
ΔrH° | 8.80 ± 0.20 | kcal/mol | TDAs | Hiraoka, Fujimaki, et al., 1993 | gas phase; B,M |
ΔrH° | 11.7 ± 2.0 | kcal/mol | IMRE | Larson and McMahon, 1985 | gas phase; B,M |
Quantity | Value | Units | Method | Reference | Comment |
ΔrS° | 13.9 | cal/mol*K | PHPMS | Hiraoka, Fujimaki, et al., 1993 | gas phase; M |
ΔrS° | 20. | cal/mol*K | N/A | Larson and McMahon, 1985 | gas phase; switching reaction,Thermochemical ladder(Cl-)t-C4H9OH, Entropy change calculated or estimated; M |
Quantity | Value | Units | Method | Reference | Comment |
ΔrG° | 4.6 ± 2.2 | kcal/mol | TDAs | Hiraoka, Fujimaki, et al., 1993 | gas phase; B |
ΔrG° | 5.7 ± 2.0 | kcal/mol | IMRE | Larson and McMahon, 1985 | gas phase; B,M |
By formula: (Cl- • C2H3N) + C2H3N = (Cl- • 2C2H3N)
Quantity | Value | Units | Method | Reference | Comment |
---|---|---|---|---|---|
ΔrH° | 12.50 ± 0.40 | kcal/mol | TDAs | Hiraoka, Mizuse, et al., 1988, 2 | gas phase; B,M |
ΔrH° | 12.00 ± 0.70 | kcal/mol | N/A | Markovich, Perera, et al., 1996 | gas phase; B |
ΔrH° | 12.20 | kcal/mol | TDAs | Yamdagni and Kebarle, 1972 | gas phase; B,M |
Quantity | Value | Units | Method | Reference | Comment |
ΔrS° | 16.3 | cal/mol*K | PHPMS | Hiraoka, Mizuse, et al., 1988, 2 | gas phase; M |
ΔrS° | 18.9 | cal/mol*K | PHPMS | Yamdagni and Kebarle, 1972 | gas phase; M |
Quantity | Value | Units | Method | Reference | Comment |
ΔrG° | 7.6 ± 1.2 | kcal/mol | TDAs | Hiraoka, Mizuse, et al., 1988, 2 | gas phase; B |
ΔrG° | 6.60 | kcal/mol | TDAs | Yamdagni and Kebarle, 1972 | gas phase; B |
By formula: Cl- + C4H4F6O = (Cl- • C4H4F6O)
Quantity | Value | Units | Method | Reference | Comment |
---|---|---|---|---|---|
ΔrH° | 26.5 | kcal/mol | ICR | Larson and McMahon, 1984, 2 | gas phase; switching reaction(Cl-)HCOOH, Entropy change calculated or estimated, DG>, ΔrH>; Larson and McMahon, 1984; M |
Quantity | Value | Units | Method | Reference | Comment |
ΔrS° | 25.0 | cal/mol*K | N/A | Larson and McMahon, 1984, 2 | gas phase; switching reaction(Cl-)HCOOH, Entropy change calculated or estimated, DG>, ΔrH>; Larson and McMahon, 1984; M |
Quantity | Value | Units | Method | Reference | Comment |
ΔrG° | 19.0 | kcal/mol | ICR | Larson and McMahon, 1984, 2 | gas phase; switching reaction(Cl-)HCOOH, Entropy change calculated or estimated, DG>, ΔrH>; Larson and McMahon, 1984; M |
By formula: (Cl- • 5H2O) + H2O = (Cl- • 6H2O)
Bond type: Hydrogen bond (negative ion to hydride)
Quantity | Value | Units | Method | Reference | Comment |
---|---|---|---|---|---|
ΔrH° | 8.8 ± 1.0 | kcal/mol | TDAs | Hiraoka and Mizuse, 1987 | gas phase; B |
ΔrH° | 8.50 | kcal/mol | N/A | Markovich, Pollack, et al., 1994 | gas phase; For photodissociation plus electron loss. Affinity is difference from lower solvated ion.; B |
ΔrH° | 8.8 ± 0.4 | kcal/mol | PHPMS | Hiraoka, Mizuse, et al., 1988, 2 | gas phase; M |
Quantity | Value | Units | Method | Reference | Comment |
ΔrS° | 21.2 | cal/mol*K | PHPMS | Hiraoka, Mizuse, et al., 1988, 2 | gas phase; M |
Quantity | Value | Units | Method | Reference | Comment |
ΔrG° | 2.4 ± 1.0 | kcal/mol | TDAs | Hiraoka and Mizuse, 1987 | gas phase; B |
By formula: Cl- + CH3Br = (Cl- • CH3Br)
Quantity | Value | Units | Method | Reference | Comment |
---|---|---|---|---|---|
ΔrH° | 12.5 ± 1.0 | kcal/mol | TDAs | Li, Ross, et al., 1996 | gas phase; B |
ΔrH° | 10.90 ± 0.50 | kcal/mol | TDAs | Dougherty and Roberts, 1974 | gas phase; B,M |
ΔrH° | 12.2 ± 3.0 | kcal/mol | IMRB | Riveros, Breda, et al., 1973 | gas phase; Anchored: Larson and McMahon, 1984, 3; B |
Quantity | Value | Units | Method | Reference | Comment |
ΔrS° | 12.8 | cal/mol*K | HPMS | Dougherty and Roberts, 1974 | gas phase; Entropy change is questionable; M |
Quantity | Value | Units | Method | Reference | Comment |
ΔrG° | 6.80 ± 0.20 | kcal/mol | TDAs | Li, Ross, et al., 1996 | gas phase; B |
ΔrG° | 7.1 ± 1.2 | kcal/mol | TDAs | Dougherty and Roberts, 1974 | gas phase; B |
By formula: (Cl- • HCl) + HCl = (Cl- • 2HCl)
Bond type: Hydrogen bond (negative ion to hydride)
Quantity | Value | Units | Method | Reference | Comment |
---|---|---|---|---|---|
ΔrH° | 15.20 ± 0.20 | kcal/mol | TDAs | Yamdagni and Kebarle, 1974 | gas phase; B,M |
ΔrH° | 14.0 | kcal/mol | PHPMS | Caldwell and Kebarle, 1985 | gas phase; switching reaction(Cl- HCl)SO2; M |
Quantity | Value | Units | Method | Reference | Comment |
ΔrS° | 20.4 | cal/mol*K | PHPMS | Caldwell and Kebarle, 1985 | gas phase; switching reaction(Cl- HCl)SO2; M |
ΔrS° | 24.4 | cal/mol*K | PHPMS | Yamdagni and Kebarle, 1974 | gas phase; M |
Quantity | Value | Units | Method | Reference | Comment |
ΔrG° | 7.90 ± 0.20 | kcal/mol | TDAs | Yamdagni and Kebarle, 1974 | gas phase; B |
By formula: Cl- + Cl4Th = (Cl- • Cl4Th)
Quantity | Value | Units | Method | Reference | Comment |
---|---|---|---|---|---|
ΔrH° | 24.2 | kcal/mol | ICR | Larson and McMahon, 1985 | gas phase; switching reaction,Thermochemical ladder(t-C4H9OH), Entropy change calculated or estimated; M |
Quantity | Value | Units | Method | Reference | Comment |
ΔrS° | 22. | cal/mol*K | N/A | Larson and McMahon, 1985 | gas phase; switching reaction,Thermochemical ladder(t-C4H9OH), Entropy change calculated or estimated; M |
Quantity | Value | Units | Method | Reference | Comment |
ΔrG° | 17.6 | kcal/mol | ICR | Larson and McMahon, 1985 | gas phase; switching reaction,Thermochemical ladder(t-C4H9OH), Entropy change calculated or estimated; M |
By formula: Cl- + C2H3ClO2 = (Cl- • C2H3ClO2)
Quantity | Value | Units | Method | Reference | Comment |
---|---|---|---|---|---|
ΔrH° | 14.1 | kcal/mol | ICR | Larson and McMahon, 1984 | gas phase; switching reaction(Cl-)t-C4H9OH, Entropy change calculated or estimated; French, Ikuta, et al., 1982; M |
Quantity | Value | Units | Method | Reference | Comment |
ΔrS° | 21.0 | cal/mol*K | N/A | Larson and McMahon, 1984 | gas phase; switching reaction(Cl-)t-C4H9OH, Entropy change calculated or estimated; French, Ikuta, et al., 1982; M |
Quantity | Value | Units | Method | Reference | Comment |
ΔrG° | 7.8 | kcal/mol | ICR | Larson and McMahon, 1984 | gas phase; switching reaction(Cl-)t-C4H9OH, Entropy change calculated or estimated; French, Ikuta, et al., 1982; M |

Gas phase ion energetics data

Data compiled by: John E. Bartmess
Protonation reactions
Quantity | Value | Units | Method | Reference | Comment |
---|---|---|---|---|---|
ΔrH° | 333.40 | kcal/mol | N/A | Martin and Hepburn, 1998 | gas phase; Given: ΔHacid(0K)=116288.7±0.6 cm-1, or 332.486±0.002 kcal/mol |
ΔrH° | 333.6 ± 2.1 | kcal/mol | G+TS | Fujio, McIver, et al., 1981 | gas phase; value altered from reference due to change in acidity scale |
ΔrH° | 329.10 | kcal/mol | N/A | Check, Faust, et al., 2001 | gas phase; FeCC-(q); ; ΔS(EA)=5.0 |
Quantity | Value | Units | Method | Reference | Comment |
ΔrG° | 328.10 ± 0.10 | kcal/mol | H-TS | Martin and Hepburn, 1998 | gas phase; Given: ΔHacid(0K)=116288.7±0.6 cm-1, or 332.486±0.002 kcal/mol |
ΔrG° | 328.3 ± 2.0 | kcal/mol | IMRE | Fujio, McIver, et al., 1981 | gas phase; value altered from reference due to change in acidity scale |
ΔrG° | 323.70 | kcal/mol | N/A | Check, Faust, et al., 2001 | gas phase; FeCC-(q); ; ΔS(EA)=5.0 |

Ion clustering data

Data compiled as indicated in comments:
B - John E. Bartmess
M - Michael M. Meot-Ner (Mautner) and Sharon G. Lias
Clustering reactions
= C4HClF9-
By formula: Cl- = C4HClF9-
Quantity | Value | Units | Method | Reference | Comment |
---|---|---|---|---|---|
ΔrG° | 15.50 ± 0.30 | kcal/mol | IMRE | Guerrero, Herrero, et al., 2009 | gas phase; B |
= C5H10Cl-
By formula: Cl- = C5H10Cl-
Quantity | Value | Units | Method | Reference | Comment |
---|---|---|---|---|---|
ΔrH° | 8.51 | kcal/mol | N/A | Ziegler, Gamble, et al., 2013 | gas phase; B |
Quantity | Value | Units | Method | Reference | Comment |
ΔrG° | 2.61 | kcal/mol | N/A | Ziegler, Gamble, et al., 2013 | gas phase; B |
= C5H12Cl-
By formula: Cl- = C5H12Cl-
Quantity | Value | Units | Method | Reference | Comment |
---|---|---|---|---|---|
ΔrH° | 8.96 | kcal/mol | N/A | Ziegler, Gamble, et al., 2013 | gas phase; B |
Quantity | Value | Units | Method | Reference | Comment |
ΔrG° | 2.61 | kcal/mol | N/A | Ziegler, Gamble, et al., 2013 | gas phase; B |
= C6H12Cl-
By formula: Cl- = C6H12Cl-
Quantity | Value | Units | Method | Reference | Comment |
---|---|---|---|---|---|
ΔrH° | 9.56 | kcal/mol | N/A | Ziegler, Gamble, et al., 2013 | gas phase; B |
Quantity | Value | Units | Method | Reference | Comment |
ΔrG° | 3.00 | kcal/mol | N/A | Ziegler, Gamble, et al., 2013 | gas phase; B |
= C6H14Cl-
By formula: Cl- = C6H14Cl-
Quantity | Value | Units | Method | Reference | Comment |
---|---|---|---|---|---|
ΔrH° | 10.18 | kcal/mol | N/A | Ziegler, Gamble, et al., 2013 | gas phase; B |
Quantity | Value | Units | Method | Reference | Comment |
ΔrG° | 3.20 | kcal/mol | N/A | Ziegler, Gamble, et al., 2013 | gas phase; B |
= C7H14Cl-
By formula: Cl- = C7H14Cl-
Quantity | Value | Units | Method | Reference | Comment |
---|---|---|---|---|---|
ΔrH° | 10.52 | kcal/mol | N/A | Ziegler, Gamble, et al., 2013 | gas phase; B |
Quantity | Value | Units | Method | Reference | Comment |
ΔrG° | 3.54 | kcal/mol | N/A | Ziegler, Gamble, et al., 2013 | gas phase; B |
= C7H16Cl-
By formula: Cl- = C7H16Cl-
Quantity | Value | Units | Method | Reference | Comment |
---|---|---|---|---|---|
ΔrH° | 10.52 | kcal/mol | N/A | Ziegler, Gamble, et al., 2013 | gas phase; B |
Quantity | Value | Units | Method | Reference | Comment |
ΔrG° | 3.60 | kcal/mol | N/A | Ziegler, Gamble, et al., 2013 | gas phase; B |
= C8H8Cl-
By formula: Cl- = C8H8Cl-
Quantity | Value | Units | Method | Reference | Comment |
---|---|---|---|---|---|
ΔrH° | 20.1 ± 1.6 | kcal/mol | CIDT | Hammad and Wenthold, 2000 | gas phase; B |
= C8H16Cl-
By formula: Cl- = C8H16Cl-
Quantity | Value | Units | Method | Reference | Comment |
---|---|---|---|---|---|
ΔrH° | 10.52 | kcal/mol | N/A | Ziegler, Gamble, et al., 2013 | gas phase; B |
Quantity | Value | Units | Method | Reference | Comment |
ΔrG° | 3.25 | kcal/mol | N/A | Ziegler, Gamble, et al., 2013 | gas phase; B |
= C8H18Cl-
By formula: Cl- = C8H18Cl-
Quantity | Value | Units | Method | Reference | Comment |
---|---|---|---|---|---|
ΔrH° | 11.74 | kcal/mol | N/A | Ziegler, Gamble, et al., 2013 | gas phase; B |
Quantity | Value | Units | Method | Reference | Comment |
ΔrG° | 4.47 | kcal/mol | N/A | Ziegler, Gamble, et al., 2013 | gas phase; B |
= ClN2O-
By formula: Cl- = ClN2O-
Quantity | Value | Units | Method | Reference | Comment |
---|---|---|---|---|---|
ΔrH° | 4.50 ± 0.10 | kcal/mol | N/A | Boesl, Distelrath, et al., 2008 | gas phase; B |
By formula: Cl- + AlClF2 = (Cl- • AlClF2)
Quantity | Value | Units | Method | Reference | Comment |
---|---|---|---|---|---|
ΔrH° | 74.3 ± 2.9 | kcal/mol | TDAs | Pervova, Korobov, et al., 1992 | gas phase; Thermo at 0K, experiments at 800-1100K. See also AlCl2F..F-; value altered from reference due to conversion from electron convention to ion convention; B |
By formula: Cl- + AlCl2F = (Cl- • AlCl2F)
Quantity | Value | Units | Method | Reference | Comment |
---|---|---|---|---|---|
ΔrH° | 75.3 ± 2.9 | kcal/mol | TDAs | Pervova, Korobov, et al., 1992 | gas phase; Thermo at 0K, experiemnts at 800-1100K. See also AlCl3..F-; value altered from reference due to conversion from electron convention to ion convention; B |
By formula: Cl- + AlCl3 = (Cl- • AlCl3)
Quantity | Value | Units | Method | Reference | Comment |
---|---|---|---|---|---|
ΔrH° | 76.7 ± 2.9 | kcal/mol | TDAs | Pervova, Korobov, et al., 1992 | gas phase; Thermo at 0K, experiments at 800-1100 K; value altered from reference due to conversion from electron convention to ion convention; B |
By formula: Cl- + AlF3 = (Cl- • AlF3)
Quantity | Value | Units | Method | Reference | Comment |
---|---|---|---|---|---|
ΔrH° | 74.3 ± 2.9 | kcal/mol | TDAs | Pervova, Korobov, et al., 1992 | gas phase; Thermo at 0K, experiment at 800-1100 K. See also AlClF2..F-; value altered from reference due to conversion from electron convention to ion convention; B |
+
= AsCl4-
By formula: Cl- + AsCl3 = AsCl4-
Quantity | Value | Units | Method | Reference | Comment |
---|---|---|---|---|---|
ΔrH° | 27.5 ± 1.7 | kcal/mol | CIDT | Walker, Check, et al., 2002 | gas phase; B |
By formula: Cl- + AsF3 = (Cl- • AsF3)
Quantity | Value | Units | Method | Reference | Comment |
---|---|---|---|---|---|
ΔrH° | 25.8 ± 2.0 | kcal/mol | IMRE | Larson and McMahon, 1985 | gas phase; B,M |
Quantity | Value | Units | Method | Reference | Comment |
ΔrS° | 24. | cal/mol*K | N/A | Larson and McMahon, 1985 | gas phase; switching reaction,Thermochemical ladder(Cl-)t-C4H9OH, Entropy change calculated or estimated; M |
Quantity | Value | Units | Method | Reference | Comment |
ΔrG° | 18.6 ± 2.0 | kcal/mol | IMRE | Larson and McMahon, 1985 | gas phase; B,M |
By formula: Cl- + BCl3 = (Cl- • BCl3)
Quantity | Value | Units | Method | Reference | Comment |
---|---|---|---|---|---|
ΔrH° | 69.0 ± 2.0 | kcal/mol | Ther | Krivtsov, Titova, et al., 1977 | gas phase; Halide affinities from this reference are too high. G3MP2B3 calculations indicate an dHaff ca. 46 kcal/mol; value altered from reference due to conversion from electron convention to ion convention; B |
By formula: Cl- + BF3 = (Cl- • BF3)
Quantity | Value | Units | Method | Reference | Comment |
---|---|---|---|---|---|
ΔrH° | 26.0 ± 2.0 | kcal/mol | IMRE | Larson and McMahon, 1985 | gas phase; B,M |
Quantity | Value | Units | Method | Reference | Comment |
ΔrS° | 23. | cal/mol*K | N/A | Larson and McMahon, 1985 | gas phase; switching reaction,Thermochemical ladder(Cl-)t-C4H9OH, Entropy change calculated or estimated; M |
Quantity | Value | Units | Method | Reference | Comment |
ΔrG° | 19.3 ± 2.0 | kcal/mol | IMRE | Larson and McMahon, 1985 | gas phase; B,M |
By formula: Cl- + BiCl3 = BiCl4-
Quantity | Value | Units | Method | Reference | Comment |
---|---|---|---|---|---|
ΔrH° | 36.6 ± 3.6 | kcal/mol | CIDT | Walker, Check, et al., 2002 | gas phase; B |
+
= CBrClF3-
By formula: Cl- + CBrF3 = CBrClF3-
Quantity | Value | Units | Method | Reference | Comment |
---|---|---|---|---|---|
ΔrH° | 16.50 ± 0.20 | kcal/mol | TDAs | Bogdanov and McMahon, 2006 | gas phase; B |
Quantity | Value | Units | Method | Reference | Comment |
ΔrG° | 9.20 | kcal/mol | TDAs | Bogdanov and McMahon, 2006 | gas phase; B |
By formula: Cl- + CCl2O = (Cl- • CCl2O)
Quantity | Value | Units | Method | Reference | Comment |
---|---|---|---|---|---|
ΔrH° | 12.5 ± 2.0 | kcal/mol | IMRE | Larson and McMahon, 1985 | gas phase; B,M |
Quantity | Value | Units | Method | Reference | Comment |
ΔrS° | 20. | cal/mol*K | N/A | Larson and McMahon, 1985 | gas phase; switching reaction,Thermochemical ladder(Cl-)t-C4H9OH, Entropy change calculated or estimated; M |
Quantity | Value | Units | Method | Reference | Comment |
ΔrG° | 6.5 ± 2.0 | kcal/mol | IMRE | Larson and McMahon, 1985 | gas phase; B,M |
By formula: Cl- + CCl4 = (Cl- • CCl4)
Quantity | Value | Units | Method | Reference | Comment |
---|---|---|---|---|---|
ΔrH° | 13.4 ± 2.0 | kcal/mol | TDAs | Hiraoka, Mizuno, et al., 2001 | gas phase; B |
ΔrH° | 14.20 ± 0.70 | kcal/mol | TDAs | Dougherty, Dalton, et al., 1974 | gas phase; B,M |
Quantity | Value | Units | Method | Reference | Comment |
ΔrS° | 27.8 | cal/mol*K | HPMS | Dougherty, Dalton, et al., 1974 | gas phase; M |
Quantity | Value | Units | Method | Reference | Comment |
ΔrG° | 5.05 | kcal/mol | TDAs | Hiraoka, Mizuno, et al., 2001 | gas phase; B |
ΔrG° | 5.90 ± 0.90 | kcal/mol | TDAs | Dougherty, Dalton, et al., 1974 | gas phase; B |
By formula: Cl- + CF2O = (Cl- • CF2O)
Quantity | Value | Units | Method | Reference | Comment |
---|---|---|---|---|---|
ΔrH° | 12.5 ± 2.0 | kcal/mol | IMRE | Larson and McMahon, 1985 | gas phase; B,M |
Quantity | Value | Units | Method | Reference | Comment |
ΔrS° | 20. | cal/mol*K | N/A | Larson and McMahon, 1985 | gas phase; switching reaction,Thermochemical ladder(Cl-)t-C4H9OH, Entropy change calculated or estimated; M |
Quantity | Value | Units | Method | Reference | Comment |
ΔrG° | 6.6 ± 2.0 | kcal/mol | IMRE | Larson and McMahon, 1985 | gas phase; B,M |
+
= CClF3I-
By formula: Cl- + CF3I = CClF3I-
Quantity | Value | Units | Method | Reference | Comment |
---|---|---|---|---|---|
ΔrH° | 23.60 ± 0.20 | kcal/mol | TDAs | Bogdanov and McMahon, 2006 | gas phase; B |
By formula: Cl- + CHClF2 = (Cl- • CHClF2)
Quantity | Value | Units | Method | Reference | Comment |
---|---|---|---|---|---|
ΔrH° | 17.2 ± 2.0 | kcal/mol | IMRE | Larson and McMahon, 1984, 2 | gas phase; B,M |
Quantity | Value | Units | Method | Reference | Comment |
ΔrS° | 23.0 | cal/mol*K | N/A | Larson and McMahon, 1984, 2 | gas phase; switching reaction(Cl-)CF3H, Entropy change calculated or estimated; Larson and McMahon, 1984; M |
Quantity | Value | Units | Method | Reference | Comment |
ΔrG° | 10.3 ± 2.0 | kcal/mol | IMRE | Larson and McMahon, 1984, 2 | gas phase; B,M |
By formula: Cl- + CHCl2F = (Cl- • CHCl2F)
Quantity | Value | Units | Method | Reference | Comment |
---|---|---|---|---|---|
ΔrH° | 17.6 ± 2.0 | kcal/mol | IMRE | Larson and McMahon, 1984, 2 | gas phase; B,M |
Quantity | Value | Units | Method | Reference | Comment |
ΔrS° | 23.1 | cal/mol*K | N/A | Larson and McMahon, 1984, 2 | gas phase; switching reaction(Cl-)CF3H, Entropy change calculated or estimated; Larson and McMahon, 1984; M |
Quantity | Value | Units | Method | Reference | Comment |
ΔrG° | 10.7 ± 2.0 | kcal/mol | IMRE | Larson and McMahon, 1984, 2 | gas phase; B,M |
By formula: Cl- + CHCl3 = (Cl- • CHCl3)
Quantity | Value | Units | Method | Reference | Comment |
---|---|---|---|---|---|
ΔrH° | 15.2 ± 2.0 | kcal/mol | TDAs | Yamdagni and Kebarle, 1971 | gas phase; B,M |
ΔrH° | 19.5 ± 2.0 | kcal/mol | TDAs | Hiraoka, Mizuno, et al., 2001 | gas phase; B |
ΔrH° | 18.10 | kcal/mol | Mobl | Giles and Grimsrud, 1993 | gas phase; B |
ΔrH° | 18.1 ± 2.0 | kcal/mol | IMRE | Larson and McMahon, 1984, 2 | gas phase; B,M |
ΔrH° | 19.10 ± 0.70 | kcal/mol | TDEq | Dougherty, Dalton, et al., 1974 | gas phase; B,M |
Quantity | Value | Units | Method | Reference | Comment |
ΔrS° | 23.2 | cal/mol*K | N/A | Larson and McMahon, 1984, 2 | gas phase; From thermochemical cycle(Cl-)CF3H, Entropy change calculated or estimated; Larson and McMahon, 1984; M |
ΔrS° | 24.5 | cal/mol*K | HPMS | Dougherty, Dalton, et al., 1974 | gas phase; M |
ΔrS° | 14.8 | cal/mol*K | PHPMS | Yamdagni and Kebarle, 1971 | gas phase; Entropy change is questionable; M |
Quantity | Value | Units | Method | Reference | Comment |
ΔrG° | 11. ± 1. | kcal/mol | AVG | N/A | Average of 6 values; Individual data points |
By formula: Cl- + CHF3 = (Cl- • CHF3)
Quantity | Value | Units | Method | Reference | Comment |
---|---|---|---|---|---|
ΔrH° | 16.7 ± 2.4 | kcal/mol | IMRE | Larson and McMahon, 1984, 2 | gas phase; B,M |
Quantity | Value | Units | Method | Reference | Comment |
ΔrS° | 22.9 | cal/mol*K | N/A | Larson and McMahon, 1984 | gas phase; switching reaction(Cl-)t-C4H9OH, Entropy change calculated or estimated; French, Ikuta, et al., 1982; M |
Quantity | Value | Units | Method | Reference | Comment |
ΔrG° | 9.8 ± 2.0 | kcal/mol | IMRE | Larson and McMahon, 1984, 2 | gas phase; B,M |
By formula: Cl- + CHN = (Cl- • CHN)
Quantity | Value | Units | Method | Reference | Comment |
---|---|---|---|---|---|
ΔrH° | 21.8 ± 1.0 | kcal/mol | TDAs | Meot-ner, 1988 | gas phase; B,B,M |
ΔrH° | 21.0 ± 2.0 | kcal/mol | IMRE | Larson and McMahon, 1984, 2 | gas phase; B,M |
Quantity | Value | Units | Method | Reference | Comment |
ΔrS° | 18.9 | cal/mol*K | PHPMS | Meot-ner, Cybulski, et al., 1988 | gas phase; M |
ΔrS° | 23.7 | cal/mol*K | N/A | Larson and McMahon, 1984 | gas phase; switching reaction(Cl-)t-C4H9OH, Entropy change calculated or estimated; French, Ikuta, et al., 1982; M |
Quantity | Value | Units | Method | Reference | Comment |
ΔrG° | 16.2 ± 1.6 | kcal/mol | TDAs | Meot-ner, Cybulski, et al., 1988 | gas phase; B |
ΔrG° | 16.1 ± 1.0 | kcal/mol | TDAs | Meot-ner, 1988 | gas phase; B |
ΔrG° | 13.9 ± 2.0 | kcal/mol | IMRE | Larson and McMahon, 1984, 2 | gas phase; B,M |
By formula: (Cl- • CHN) + CHN = (Cl- • 2CHN)
Quantity | Value | Units | Method | Reference | Comment |
---|---|---|---|---|---|
ΔrH° | 17.9 ± 1.0 | kcal/mol | TDAs | Meot-ner, Cybulski, et al., 1988 | gas phase; B,M |
Quantity | Value | Units | Method | Reference | Comment |
ΔrS° | 22.7 | cal/mol*K | PHPMS | Meot-ner, Cybulski, et al., 1988 | gas phase; M |
Quantity | Value | Units | Method | Reference | Comment |
ΔrG° | 11.10 | kcal/mol | TDAs | Meot-ner, Cybulski, et al., 1988 | gas phase; B |
By formula: (Cl- • 2CHN) + CHN = (Cl- • 3CHN)
Quantity | Value | Units | Method | Reference | Comment |
---|---|---|---|---|---|
ΔrH° | 13.6 ± 1.0 | kcal/mol | TDAs | Meot-ner, Cybulski, et al., 1988 | gas phase; B,M |
Quantity | Value | Units | Method | Reference | Comment |
ΔrS° | 21.4 | cal/mol*K | PHPMS | Meot-ner, Cybulski, et al., 1988 | gas phase; M |
Quantity | Value | Units | Method | Reference | Comment |
ΔrG° | 7.20 | kcal/mol | TDAs | Meot-ner, Cybulski, et al., 1988 | gas phase; B |
By formula: (Cl- • 3CHN) + CHN = (Cl- • 4CHN)
Quantity | Value | Units | Method | Reference | Comment |
---|---|---|---|---|---|
ΔrH° | 11.2 ± 1.0 | kcal/mol | TDAs | Meot-ner, Cybulski, et al., 1988 | gas phase; B,M |
Quantity | Value | Units | Method | Reference | Comment |
ΔrS° | 23.4 | cal/mol*K | PHPMS | Meot-ner, Cybulski, et al., 1988 | gas phase; M |
Quantity | Value | Units | Method | Reference | Comment |
ΔrG° | 4.20 | kcal/mol | TDAs | Meot-ner, Cybulski, et al., 1988 | gas phase; B |
By formula: (Cl- • 4CHN) + CHN = (Cl- • 5CHN)
Quantity | Value | Units | Method | Reference | Comment |
---|---|---|---|---|---|
ΔrH° | 8.8 ± 1.0 | kcal/mol | TDAs | Meot-ner, Cybulski, et al., 1988 | gas phase; B,M |
Quantity | Value | Units | Method | Reference | Comment |
ΔrS° | 21.3 | cal/mol*K | PHPMS | Meot-ner, Cybulski, et al., 1988 | gas phase; M |
Quantity | Value | Units | Method | Reference | Comment |
ΔrG° | 2.50 | kcal/mol | TDAs | Meot-ner, Cybulski, et al., 1988 | gas phase; B |
By formula: (Cl- • 5CHN) + CHN = (Cl- • 6CHN)
Quantity | Value | Units | Method | Reference | Comment |
---|---|---|---|---|---|
ΔrH° | 8.7 ± 1.0 | kcal/mol | TDAs | Meot-ner, Cybulski, et al., 1988 | gas phase; B,M |
Quantity | Value | Units | Method | Reference | Comment |
ΔrS° | 24.3 | cal/mol*K | PHPMS | Meot-ner, Cybulski, et al., 1988 | gas phase; M |
Quantity | Value | Units | Method | Reference | Comment |
ΔrG° | 1.50 | kcal/mol | TDAs | Meot-ner, Cybulski, et al., 1988 | gas phase; B |
By formula: (Cl- • 6CHN) + CHN = (Cl- • 7CHN)
Quantity | Value | Units | Method | Reference | Comment |
---|---|---|---|---|---|
ΔrH° | 7.9 ± 1.0 | kcal/mol | TDAs | Meot-ner, Cybulski, et al., 1988 | gas phase; B,M |
Quantity | Value | Units | Method | Reference | Comment |
ΔrS° | 23.1 | cal/mol*K | PHPMS | Meot-ner, Cybulski, et al., 1988 | gas phase; M |
Quantity | Value | Units | Method | Reference | Comment |
ΔrG° | 1.00 | kcal/mol | TDAs | Meot-ner, Cybulski, et al., 1988 | gas phase; B |
By formula: (Cl- • 7CHN) + CHN = (Cl- • 8CHN)
Quantity | Value | Units | Method | Reference | Comment |
---|---|---|---|---|---|
ΔrH° | 8.2 ± 1.0 | kcal/mol | TDAs | Meot-ner, Cybulski, et al., 1988 | gas phase; B,M |
Quantity | Value | Units | Method | Reference | Comment |
ΔrS° | 27.4 | cal/mol*K | PHPMS | Meot-ner, Cybulski, et al., 1988 | gas phase; M |
Quantity | Value | Units | Method | Reference | Comment |
ΔrG° | 0.0 ± 2.2 | kcal/mol | TDAs | Meot-ner, Cybulski, et al., 1988 | gas phase; B |
By formula: (Cl- • 8CHN) + CHN = (Cl- • 9CHN)
Quantity | Value | Units | Method | Reference | Comment |
---|---|---|---|---|---|
ΔrH° | 7.5 ± 1.0 | kcal/mol | TDAs | Meot-ner, Cybulski, et al., 1988 | gas phase; Entropy estimated; B,M |
Quantity | Value | Units | Method | Reference | Comment |
ΔrS° | 25. | cal/mol*K | N/A | Meot-ner, Cybulski, et al., 1988 | gas phase; Entropy change calculated or estimated; M |
Quantity | Value | Units | Method | Reference | Comment |
ΔrG° | 0.10 | kcal/mol | TDAs | Meot-ner, Cybulski, et al., 1988 | gas phase; Entropy estimated; B |
Free energy of reaction
ΔrG° (kcal/mol) | T (K) | Method | Reference | Comment |
---|---|---|---|---|
3.2 | 171. | PHPMS | Meot-ner, Cybulski, et al., 1988 | gas phase; Entropy change calculated or estimated; M |
By formula: Cl- + CH2Cl2 = (Cl- • CH2Cl2)
Quantity | Value | Units | Method | Reference | Comment |
---|---|---|---|---|---|
ΔrH° | 15.8 ± 2.0 | kcal/mol | IMRE | Larson and McMahon, 1984, 2 | gas phase; B,M |
ΔrH° | 14.8 ± 2.0 | kcal/mol | TDAs | Hiraoka, Mizuno, et al., 2001 | gas phase; B |
ΔrH° | 15.50 ± 0.30 | kcal/mol | TDEq | Dougherty, Dalton, et al., 1974 | gas phase; B,M |
Quantity | Value | Units | Method | Reference | Comment |
ΔrS° | 22.1 | cal/mol*K | N/A | Larson and McMahon, 1984, 2 | gas phase; switching reaction(Cl-)t-C4H9OH, Entropy change calculated or estimated; Kebarle, 1977; M |
ΔrS° | 22.0 | cal/mol*K | HPMS | Dougherty, Dalton, et al., 1974 | gas phase; M |
Quantity | Value | Units | Method | Reference | Comment |
ΔrG° | 9.2 ± 2.0 | kcal/mol | IMRE | Larson and McMahon, 1984, 2 | gas phase; B,M |
ΔrG° | 8.84 | kcal/mol | TDAs | Hiraoka, Mizuno, et al., 2001 | gas phase; B |
ΔrG° | 8.90 ± 0.60 | kcal/mol | TDEq | Dougherty, Dalton, et al., 1974 | gas phase; B |
By formula: Cl- + CH2O2 = (Cl- • CH2O2)
Quantity | Value | Units | Method | Reference | Comment |
---|---|---|---|---|---|
ΔrH° | 27.4 ± 2.0 | kcal/mol | TDAs | French, Ikuta, et al., 1982 | gas phase; B,M |
ΔrH° | 27.7 ± 2.1 | kcal/mol | CIDT | Walker and Sunderlin, 1999 | gas phase; B |
ΔrH° | 25.6 ± 2.0 | kcal/mol | IMRE | Larson and McMahon, 1984, 2 | gas phase; B,M |
ΔrH° | 37.2 ± 2.0 | kcal/mol | TDAs | Yamdagni and Kebarle, 1971 | gas phase; In serious disagreement with other's values. Source of error not obvious.; B,M |
Quantity | Value | Units | Method | Reference | Comment |
ΔrS° | 24.5 | cal/mol*K | PHPMS | French, Ikuta, et al., 1982 | gas phase; M |
ΔrS° | 24.1 | cal/mol*K | N/A | Larson and McMahon, 1984 | gas phase; switching reaction(Cl-)t-C4H9OH, Entropy change calculated or estimated; French, Ikuta, et al., 1982; M |
ΔrS° | 39.6 | cal/mol*K | PHPMS | Yamdagni and Kebarle, 1971 | gas phase; M |
Quantity | Value | Units | Method | Reference | Comment |
ΔrG° | 20.1 ± 2.0 | kcal/mol | TDAs | French, Ikuta, et al., 1982 | gas phase; B |
ΔrG° | 18.4 ± 2.0 | kcal/mol | IMRE | Larson and McMahon, 1984, 2 | gas phase; B,M |
ΔrG° | 25.4 ± 2.0 | kcal/mol | TDAs | Yamdagni and Kebarle, 1971 | gas phase; In serious disagreement with other's values. Source of error not obvious.; B |
By formula: (Cl- • CH2O2) + CH2O2 = (Cl- • 2CH2O2)
Quantity | Value | Units | Method | Reference | Comment |
---|---|---|---|---|---|
ΔrH° | 11.2 ± 2.1 | kcal/mol | CIDT | Walker and Sunderlin, 1999 | gas phase; B |
ΔrH° | 34.1 ± 3.1 | kcal/mol | N/A | Luczynski, Wlodek, et al., 1978 | gas phase; Buffer gas: H2. Value too bound based on French, Ikuta, et al., 1982, by Grimsrud fractionation factor ( Williamson, Knighton, et al., 1996).; B,M |
Quantity | Value | Units | Method | Reference | Comment |
ΔrS° | 55. | cal/mol*K | HPMS | Luczynski, Wlodek, et al., 1978 | gas phase; Entropy change is questionable; M |
By formula: (Cl- • 2CH2O2) + CH2O2 = (Cl- • 3CH2O2)
Quantity | Value | Units | Method | Reference | Comment |
---|---|---|---|---|---|
ΔrH° | 22.2 ± 2.7 | kcal/mol | N/A | Luczynski, Wlodek, et al., 1978 | gas phase; Buffer gas: H2. Value too bound based on French, Ikuta, et al., 1982, by Grimsrud fractionation factor ( Williamson, Knighton, et al., 1996).; B,M |
Quantity | Value | Units | Method | Reference | Comment |
ΔrS° | 35. | cal/mol*K | HPMS | Luczynski, Wlodek, et al., 1978 | gas phase; Entropy change is questionable; M |
By formula: (Cl- • 3CH2O2) + CH2O2 = (Cl- • 4CH2O2)
Quantity | Value | Units | Method | Reference | Comment |
---|---|---|---|---|---|
ΔrH° | 14.1 ± 2.2 | kcal/mol | N/A | Luczynski, Wlodek, et al., 1978 | gas phase; Buffer gas: H2. Value too bound based on French, Ikuta, et al., 1982, by Grimsrud fractionation factor ( Williamson, Knighton, et al., 1996).; B,M |
Quantity | Value | Units | Method | Reference | Comment |
ΔrS° | 20. | cal/mol*K | HPMS | Luczynski, Wlodek, et al., 1978 | gas phase; M |
By formula: (Cl- • 4CH2O2) + CH2O2 = (Cl- • 5CH2O2)
Quantity | Value | Units | Method | Reference | Comment |
---|---|---|---|---|---|
ΔrH° | 10.1 ± 2.0 | kcal/mol | N/A | Luczynski, Wlodek, et al., 1978 | gas phase; Buffer gas: H2. Value too bound based on French, Ikuta, et al., 1982, by Grimsrud fractionation factor ( Williamson, Knighton, et al., 1996).; B,M |
Quantity | Value | Units | Method | Reference | Comment |
ΔrS° | 11.5 | cal/mol*K | HPMS | Luczynski, Wlodek, et al., 1978 | gas phase; Entropy change is questionable; M |
By formula: Cl- + CH3Br = (Cl- • CH3Br)
Quantity | Value | Units | Method | Reference | Comment |
---|---|---|---|---|---|
ΔrH° | 12.5 ± 1.0 | kcal/mol | TDAs | Li, Ross, et al., 1996 | gas phase; B |
ΔrH° | 10.90 ± 0.50 | kcal/mol | TDAs | Dougherty and Roberts, 1974 | gas phase; B,M |
ΔrH° | 12.2 ± 3.0 | kcal/mol | IMRB | Riveros, Breda, et al., 1973 | gas phase; Anchored: Larson and McMahon, 1984, 3; B |
Quantity | Value | Units | Method | Reference | Comment |
ΔrS° | 12.8 | cal/mol*K | HPMS | Dougherty and Roberts, 1974 | gas phase; Entropy change is questionable; M |
Quantity | Value | Units | Method | Reference | Comment |
ΔrG° | 6.80 ± 0.20 | kcal/mol | TDAs | Li, Ross, et al., 1996 | gas phase; B |
ΔrG° | 7.1 ± 1.2 | kcal/mol | TDAs | Dougherty and Roberts, 1974 | gas phase; B |
By formula: Cl- + CH3Cl = (Cl- • CH3Cl)
Quantity | Value | Units | Method | Reference | Comment |
---|---|---|---|---|---|
ΔrH° | 10.4 ± 1.0 | kcal/mol | TDAs | Li, Ross, et al., 1996 | gas phase; B |
ΔrH° | 11.7 ± 2.0 | kcal/mol | TDAs | Hiraoka, Mizuno, et al., 2001 | gas phase; B |
ΔrH° | 12.2 ± 2.0 | kcal/mol | IMRE | Larson and McMahon, 1984, 2 | gas phase; B,M |
ΔrH° | 8.60 ± 0.20 | kcal/mol | TDAs | Dougherty, Dalton, et al., 1974 | gas phase; B,M |
ΔrH° | 15.2 ± 2.0 | kcal/mol | TDAs | Yamdagni and Kebarle, 1971 | gas phase; B |
Quantity | Value | Units | Method | Reference | Comment |
ΔrS° | 20.5 | cal/mol*K | N/A | Larson and McMahon, 1984 | gas phase; switching reaction(Cl-)t-C4H9OH, Entropy change calculated or estimated; French, Ikuta, et al., 1982; M |
ΔrS° | 15.3 | cal/mol*K | HPMS | Dougherty, Dalton, et al., 1974 | gas phase; Entropy change is questionable; M |
Quantity | Value | Units | Method | Reference | Comment |
ΔrG° | 5.80 ± 0.20 | kcal/mol | TDAs | Li, Ross, et al., 1996 | gas phase; B |
ΔrG° | 4.84 | kcal/mol | TDAs | Hiraoka, Mizuno, et al., 2001 | gas phase; B |
ΔrG° | 6.1 ± 2.0 | kcal/mol | IMRE | Larson and McMahon, 1984, 2 | gas phase; B,M |
ΔrG° | 4.10 ± 0.50 | kcal/mol | TDAs | Dougherty, Dalton, et al., 1974 | gas phase; B |
ΔrG° | 10.8 ± 2.0 | kcal/mol | TDAs | Yamdagni and Kebarle, 1971 | gas phase; B |
By formula: Cl- + CH3F = (Cl- • CH3F)
Quantity | Value | Units | Method | Reference | Comment |
---|---|---|---|---|---|
ΔrH° | 11.5 ± 2.0 | kcal/mol | IMRE | Larson and McMahon, 1984, 2 | gas phase; B,M |
Quantity | Value | Units | Method | Reference | Comment |
ΔrS° | 20.3 | cal/mol*K | N/A | Larson and McMahon, 1984, 2 | gas phase; switching reaction(Cl-)CH3Cl, Entropy change calculated or estimated; Larson and McMahon, 1984; M |
Quantity | Value | Units | Method | Reference | Comment |
ΔrG° | 5.4 | kcal/mol | ICR | Larson and McMahon, 1984, 2 | gas phase; switching reaction(Cl-)CH3Cl, Entropy change calculated or estimated; Larson and McMahon, 1984; M |
By formula: Cl- + CH3F3Si = (Cl- • CH3F3Si)
Quantity | Value | Units | Method | Reference | Comment |
---|---|---|---|---|---|
ΔrH° | 16.1 ± 2.0 | kcal/mol | IMRE | Larson and McMahon, 1985 | gas phase; B,M |
Quantity | Value | Units | Method | Reference | Comment |
ΔrS° | 22. | cal/mol*K | N/A | Larson and McMahon, 1985 | gas phase; switching reaction,Thermochemical ladder(t-C4H9OH), Entropy change calculated or estimated; M |
Quantity | Value | Units | Method | Reference | Comment |
ΔrG° | 9.5 ± 2.0 | kcal/mol | IMRE | Larson and McMahon, 1985 | gas phase; B,M |
By formula: Cl- + CH3I = (Cl- • CH3I)
Quantity | Value | Units | Method | Reference | Comment |
---|---|---|---|---|---|
ΔrH° | 9.80 ± 0.20 | kcal/mol | TDAs | Dougherty and Roberts, 1974 | gas phase; B,M |
Quantity | Value | Units | Method | Reference | Comment |
ΔrS° | 7.3 | cal/mol*K | HPMS | Dougherty and Roberts, 1974 | gas phase; Entropy change is questionable; M |
Quantity | Value | Units | Method | Reference | Comment |
ΔrG° | 7.0 ± 1.3 | kcal/mol | TDAs | Dougherty and Roberts, 1974 | gas phase; B |
By formula: Cl- + CH3NO2 = (Cl- • CH3NO2)
Quantity | Value | Units | Method | Reference | Comment |
---|---|---|---|---|---|
ΔrH° | 15.60 ± 0.60 | kcal/mol | TDAs | Wincel, 2003 | gas phase; B |
ΔrH° | 16.70 ± 0.10 | kcal/mol | TDAs | Sieck, 1985 | gas phase; B,M |
ΔrH° | 16.3 ± 3.0 | kcal/mol | IMRB | Riveros, Breda, et al., 1973 | gas phase; Anchored: Larson and McMahon, 1984, 3; B |
Quantity | Value | Units | Method | Reference | Comment |
ΔrS° | 17.1 | cal/mol*K | PHPMS | Sieck, 1985 | gas phase; M |
Quantity | Value | Units | Method | Reference | Comment |
ΔrG° | 9.20 | kcal/mol | TDAs | Wincel, 2003 | gas phase; B |
ΔrG° | 11.60 ± 0.10 | kcal/mol | TDAs | Sieck, 1985 | gas phase; B |
By formula: (Cl- • CH3NO2) + CH3NO2 = (Cl- • 2CH3NO2)
Quantity | Value | Units | Method | Reference | Comment |
---|---|---|---|---|---|
ΔrH° | 13.00 ± 0.50 | kcal/mol | TDAs | Wincel, 2003 | gas phase; B |
ΔrH° | 13.10 ± 0.10 | kcal/mol | TDAs | Sieck, 1985 | gas phase; B,M |
Quantity | Value | Units | Method | Reference | Comment |
ΔrS° | 18.3 | cal/mol*K | PHPMS | Sieck, 1985 | gas phase; M |
Quantity | Value | Units | Method | Reference | Comment |
ΔrG° | 5.70 | kcal/mol | TDAs | Wincel, 2003 | gas phase; B |
ΔrG° | 7.60 ± 0.30 | kcal/mol | TDAs | Sieck, 1985 | gas phase; B |
By formula: Cl- + CH4O = (Cl- • CH4O)
Quantity | Value | Units | Method | Reference | Comment |
---|---|---|---|---|---|
ΔrH° | 17. ± 3. | kcal/mol | AVG | N/A | Average of 8 values; Individual data points |
Quantity | Value | Units | Method | Reference | Comment |
ΔrS° | 22.6 | cal/mol*K | HPMS | Evans and Keesee, 1991 | gas phase; M |
ΔrS° | 24.1 | cal/mol*K | PHPMS | Hiraoka and Mizuse, 1987 | gas phase; M |
ΔrS° | 22.0 | cal/mol*K | PHPMS | Sieck, 1985 | gas phase; M |
ΔrS° | 22.9 | cal/mol*K | N/A | Larson and McMahon, 1984 | gas phase; switching reaction(Cl-)t-C4H9OH, Entropy change calculated or estimated; French, Ikuta, et al., 1982; M |
ΔrS° | 14.8 | cal/mol*K | PHPMS | Yamdagni, Payzant, et al., 1973 | gas phase; Entropy change is questionable; M |
Quantity | Value | Units | Method | Reference | Comment |
ΔrG° | 10.1 ± 0.8 | kcal/mol | AVG | N/A | Average of 10 values; Individual data points |
By formula: (Cl- • CH4O) + CH4O = (Cl- • 2CH4O)
Quantity | Value | Units | Method | Reference | Comment |
---|---|---|---|---|---|
ΔrH° | 14.10 ± 0.40 | kcal/mol | TDAs | Bogdanov, Peschke, et al., 1999 | gas phase; B |
ΔrH° | 13.70 ± 0.20 | kcal/mol | TDAs | Evans and Keesee, 1991 | gas phase; B,M |
ΔrH° | 14.1 ± 1.0 | kcal/mol | TDAs | Hiraoka and Mizuse, 1987 | gas phase; B,M |
ΔrH° | 13.00 ± 0.70 | kcal/mol | TDAs | Yamdagni, Payzant, et al., 1973 | gas phase; B,M |
Quantity | Value | Units | Method | Reference | Comment |
ΔrS° | 24.2 | cal/mol*K | PHPMS | Hiraoka and Mizuse, 1987 | gas phase; M |
ΔrS° | 22.0 | cal/mol*K | HPMS | Evans and Keesee, 1991 | gas phase; M |
ΔrS° | 19.4 | cal/mol*K | PHPMS | Yamdagni, Payzant, et al., 1973 | gas phase; M |
Quantity | Value | Units | Method | Reference | Comment |
ΔrG° | 7.30 | kcal/mol | TDAs | Bogdanov, Peschke, et al., 1999 | gas phase; B |
ΔrG° | 7.10 | kcal/mol | TDAs | Evans and Keesee, 1991 | gas phase; B |
ΔrG° | 6.8 ± 1.0 | kcal/mol | TDAs | Hiraoka and Mizuse, 1987 | gas phase; B |
ΔrG° | 7.20 ± 0.40 | kcal/mol | TDAs | Yamdagni, Payzant, et al., 1973 | gas phase; B |
By formula: (Cl- • 2CH4O) + CH4O = (Cl- • 3CH4O)
Quantity | Value | Units | Method | Reference | Comment |
---|---|---|---|---|---|
ΔrH° | 11.50 ± 0.20 | kcal/mol | TDAs | Bogdanov, Peschke, et al., 1999 | gas phase; B |
ΔrH° | 10.80 ± 0.30 | kcal/mol | TDAs | Evans and Keesee, 1991 | gas phase; B,M |
ΔrH° | 11.8 ± 1.0 | kcal/mol | TDAs | Hiraoka and Mizuse, 1987 | gas phase; B,M |
ΔrH° | 12.30 ± 0.60 | kcal/mol | N/A | Yamdagni, Payzant, et al., 1973 | gas phase; B,M |
Quantity | Value | Units | Method | Reference | Comment |
ΔrS° | 22.9 | cal/mol*K | PHPMS | Hiraoka and Mizuse, 1987 | gas phase; M |
ΔrS° | 22.7 | cal/mol*K | HPMS | Evans and Keesee, 1991 | gas phase; M |
ΔrS° | 23.6 | cal/mol*K | PHPMS | Yamdagni, Payzant, et al., 1973 | gas phase; M |
Quantity | Value | Units | Method | Reference | Comment |
ΔrG° | 5.06 | kcal/mol | TDAs | Bogdanov, Peschke, et al., 1999 | gas phase; B |
ΔrG° | 4.00 | kcal/mol | TDAs | Evans and Keesee, 1991 | gas phase; B |
ΔrG° | 4.9 ± 1.0 | kcal/mol | TDAs | Hiraoka and Mizuse, 1987 | gas phase; B |
ΔrG° | 5.20 ± 0.30 | kcal/mol | TDAs | Yamdagni, Payzant, et al., 1973 | gas phase; B |
By formula: (Cl- • 3CH4O) + CH4O = (Cl- • 4CH4O)
Quantity | Value | Units | Method | Reference | Comment |
---|---|---|---|---|---|
ΔrH° | 10.5 ± 1.0 | kcal/mol | TDAs | Hiraoka and Mizuse, 1987 | gas phase; B,M |
ΔrH° | 10.50 | kcal/mol | TDAs | Evans and Keesee, 1991 | gas phase; B |
ΔrH° | 11.20 ± 0.60 | kcal/mol | TDAs | Yamdagni, Payzant, et al., 1973 | gas phase; B,M |
Quantity | Value | Units | Method | Reference | Comment |
ΔrS° | 22.9 | cal/mol*K | PHPMS | Hiraoka and Mizuse, 1987 | gas phase; M |
ΔrS° | 26.4 | cal/mol*K | PHPMS | Yamdagni, Payzant, et al., 1973 | gas phase; M |
Quantity | Value | Units | Method | Reference | Comment |
ΔrG° | 3.6 ± 1.0 | kcal/mol | TDAs | Hiraoka and Mizuse, 1987 | gas phase; B |
ΔrG° | 3.70 | kcal/mol | TDAs | Evans and Keesee, 1991 | gas phase; B |
ΔrG° | 3.30 ± 0.20 | kcal/mol | TDAs | Yamdagni, Payzant, et al., 1973 | gas phase; B |
By formula: (Cl- • 4CH4O) + CH4O = (Cl- • 5CH4O)
Quantity | Value | Units | Method | Reference | Comment |
---|---|---|---|---|---|
ΔrH° | 9.2 ± 1.0 | kcal/mol | TDAs | Hiraoka and Mizuse, 1987 | gas phase; B,M |
ΔrH° | 10.50 ± 0.50 | kcal/mol | N/A | Yamdagni, Payzant, et al., 1973 | gas phase; B,M |
Quantity | Value | Units | Method | Reference | Comment |
ΔrS° | 21.7 | cal/mol*K | PHPMS | Hiraoka and Mizuse, 1987 | gas phase; M |
ΔrS° | 25.5 | cal/mol*K | PHPMS | Yamdagni, Payzant, et al., 1973 | gas phase; M |
Quantity | Value | Units | Method | Reference | Comment |
ΔrG° | 2.7 ± 1.0 | kcal/mol | TDAs | Hiraoka and Mizuse, 1987 | gas phase; B |
ΔrG° | 2.90 ± 0.10 | kcal/mol | TDAs | Yamdagni, Payzant, et al., 1973 | gas phase; B |
By formula: (Cl- • 5CH4O) + CH4O = (Cl- • 6CH4O)
Quantity | Value | Units | Method | Reference | Comment |
---|---|---|---|---|---|
ΔrH° | 8.9 ± 1.0 | kcal/mol | TDAs | Hiraoka and Mizuse, 1987 | gas phase; B,M |
Quantity | Value | Units | Method | Reference | Comment |
ΔrS° | 22.2 | cal/mol*K | PHPMS | Hiraoka and Mizuse, 1987 | gas phase; M |
Quantity | Value | Units | Method | Reference | Comment |
ΔrG° | 2.2 ± 1.0 | kcal/mol | TDAs | Hiraoka and Mizuse, 1987 | gas phase; B |
By formula: (Cl- • 6CH4O) + CH4O = (Cl- • 7CH4O)
Quantity | Value | Units | Method | Reference | Comment |
---|---|---|---|---|---|
ΔrH° | 8.0 ± 1.0 | kcal/mol | TDAs | Hiraoka and Mizuse, 1987 | gas phase; B,M |
Quantity | Value | Units | Method | Reference | Comment |
ΔrS° | 20.1 | cal/mol*K | PHPMS | Hiraoka and Mizuse, 1987 | gas phase; M |
Quantity | Value | Units | Method | Reference | Comment |
ΔrG° | 2.0 ± 1.0 | kcal/mol | TDAs | Hiraoka and Mizuse, 1987 | gas phase; B |
By formula: (Cl- • 7CH4O) + CH4O = (Cl- • 8CH4O)
Quantity | Value | Units | Method | Reference | Comment |
---|---|---|---|---|---|
ΔrH° | 7.6 ± 1.0 | kcal/mol | TDAs | Hiraoka and Mizuse, 1987 | gas phase; B,M |
Quantity | Value | Units | Method | Reference | Comment |
ΔrS° | 19.7 | cal/mol*K | PHPMS | Hiraoka and Mizuse, 1987 | gas phase; M |
Quantity | Value | Units | Method | Reference | Comment |
ΔrG° | 1.7 ± 1.0 | kcal/mol | TDAs | Hiraoka and Mizuse, 1987 | gas phase; B |
By formula: (Cl- • 8CH4O) + CH4O = (Cl- • 9CH4O)
Quantity | Value | Units | Method | Reference | Comment |
---|---|---|---|---|---|
ΔrH° | 7.6 ± 1.0 | kcal/mol | TDAs | Hiraoka and Mizuse, 1987 | gas phase; B,M |
Quantity | Value | Units | Method | Reference | Comment |
ΔrS° | 20.6 | cal/mol*K | PHPMS | Hiraoka and Mizuse, 1987 | gas phase; M |
Quantity | Value | Units | Method | Reference | Comment |
ΔrG° | 1.4 ± 1.0 | kcal/mol | TDAs | Hiraoka and Mizuse, 1987 | gas phase; B |
By formula: (Cl- • 9CH4O) + CH4O = (Cl- • 10CH4O)
Quantity | Value | Units | Method | Reference | Comment |
---|---|---|---|---|---|
ΔrH° | 7.4 ± 1.0 | kcal/mol | TDAs | Hiraoka and Mizuse, 1987 | gas phase; B,M |
Quantity | Value | Units | Method | Reference | Comment |
ΔrS° | 20.1 | cal/mol*K | PHPMS | Hiraoka and Mizuse, 1987 | gas phase; M |
Quantity | Value | Units | Method | Reference | Comment |
ΔrG° | 1.4 ± 1.0 | kcal/mol | TDAs | Hiraoka and Mizuse, 1987 | gas phase; B |
By formula: (Cl- • 10CH4O) + CH4O = (Cl- • 11CH4O)
Quantity | Value | Units | Method | Reference | Comment |
---|---|---|---|---|---|
ΔrH° | 7.3 ± 1.0 | kcal/mol | TDAs | Hiraoka and Mizuse, 1987 | gas phase; Estimated entropy; single temperature measurement; B,M |
Quantity | Value | Units | Method | Reference | Comment |
ΔrS° | 20. | cal/mol*K | N/A | Hiraoka and Mizuse, 1987 | gas phase; Entropy change calculated or estimated; M |
Quantity | Value | Units | Method | Reference | Comment |
ΔrG° | 1.3 ± 1.0 | kcal/mol | TDAs | Hiraoka and Mizuse, 1987 | gas phase; Estimated entropy; single temperature measurement; B |
By formula: (Cl- • CH4O) + H2O = (Cl- • H2O • CH4O)
Bond type: Hydrogen bond (negative ion to hydride)
Quantity | Value | Units | Method | Reference | Comment |
---|---|---|---|---|---|
ΔrH° | 10.9 | kcal/mol | HPMS | Evans and Keesee, 1991 | gas phase; M |
Quantity | Value | Units | Method | Reference | Comment |
ΔrS° | 16.9 | cal/mol*K | HPMS | Evans and Keesee, 1991 | gas phase; M |
By formula: (Cl- • 2CH4O) + H2O = (Cl- • H2O • 2CH4O)
Bond type: Hydrogen bond (negative ion to hydride)
Quantity | Value | Units | Method | Reference | Comment |
---|---|---|---|---|---|
ΔrH° | 7.7 | kcal/mol | HPMS | Evans and Keesee, 1991 | gas phase; M |
Quantity | Value | Units | Method | Reference | Comment |
ΔrS° | 11. | cal/mol*K | HPMS | Evans and Keesee, 1991 | gas phase; M |
By formula: (Cl- • CH4O • H2O) + CH4O = (Cl- • 2CH4O • H2O)
Quantity | Value | Units | Method | Reference | Comment |
---|---|---|---|---|---|
ΔrH° | 10.8 | kcal/mol | HPMS | Evans and Keesee, 1991 | gas phase; M |
Quantity | Value | Units | Method | Reference | Comment |
ΔrS° | 19. | cal/mol*K | HPMS | Evans and Keesee, 1991 | gas phase; M |
By formula: Cl- + CH4S = (Cl- • CH4S)
Quantity | Value | Units | Method | Reference | Comment |
---|---|---|---|---|---|
ΔrH° | 15.5 ± 3.0 | kcal/mol | IMRB | Staneke, Groothuis, et al., 1995 | gas phase; Chloride affinity comparable to that of CHCl3; B |
Quantity | Value | Units | Method | Reference | Comment |
ΔrG° | 10.8 ± 3.0 | kcal/mol | IMRB | Staneke, Groothuis, et al., 1995 | gas phase; Chloride affinity comparable to that of CHCl3; B |
+
= CH4Cl-
By formula: Cl- + CH4 = CH4Cl-
Quantity | Value | Units | Method | Reference | Comment |
---|---|---|---|---|---|
ΔrH° | 3.80 | kcal/mol | N/A | Hiraoka, Mizuno, et al., 2001 | gas phase; B |
Quantity | Value | Units | Method | Reference | Comment |
ΔrG° | -2.16 | kcal/mol | TDAs | Hiraoka, Mizuno, et al., 2001 | gas phase; B |
By formula: Cl- + CO2 = (Cl- • CO2)
Quantity | Value | Units | Method | Reference | Comment |
---|---|---|---|---|---|
ΔrH° | 6.80 ± 0.50 | kcal/mol | PDis | Arnold, Bradforth, et al., 1995 | gas phase; Affinity: shift in apparent EA from lesser-solvated ion. Ignores any neutral-neutral bond.; B |
ΔrH° | 7.60 | kcal/mol | TDEq | Hiraoka, Shoda, et al., 1986 | gas phase; B,M |
ΔrH° | 8.00 ± 0.10 | kcal/mol | TDAs | Keesee, Lee, et al., 1980 | gas phase; B,M |
Quantity | Value | Units | Method | Reference | Comment |
ΔrS° | 18.2 | cal/mol*K | PHPMS | Hiraoka, Shoda, et al., 1986 | gas phase; M |
ΔrS° | 19.6 | cal/mol*K | HPMS | Keesee, Lee, et al., 1980 | gas phase; M |
Quantity | Value | Units | Method | Reference | Comment |
ΔrG° | 2.10 | kcal/mol | TDEq | Hiraoka, Shoda, et al., 1986 | gas phase; B |
ΔrG° | 2.10 ± 0.10 | kcal/mol | TDAs | Keesee, Lee, et al., 1980 | gas phase; B |
By formula: (Cl- • CO2) + CO2 = (Cl- • 2CO2)
Quantity | Value | Units | Method | Reference | Comment |
---|---|---|---|---|---|
ΔrH° | 7.2 ± 1.0 | kcal/mol | TDAs | Hiraoka, Mizuse, et al., 1987 | gas phase; B |
ΔrH° | 7.20 | kcal/mol | TDAs | Hiraoka, Shoda, et al., 1986 | gas phase; B,M |
Quantity | Value | Units | Method | Reference | Comment |
ΔrS° | 20.8 | cal/mol*K | PHPMS | Hiraoka, Shoda, et al., 1986 | gas phase; M |
Quantity | Value | Units | Method | Reference | Comment |
ΔrG° | -1.4 ± 2.0 | kcal/mol | TDAs | Hiraoka, Mizuse, et al., 1987 | gas phase; B |
ΔrG° | 1.00 | kcal/mol | TDAs | Hiraoka, Shoda, et al., 1986 | gas phase; B |
By formula: (Cl- • 2CO2) + CO2 = (Cl- • 3CO2)
Quantity | Value | Units | Method | Reference | Comment |
---|---|---|---|---|---|
ΔrH° | 6.8 ± 1.0 | kcal/mol | TDAs | Hiraoka, Mizuse, et al., 1987 | gas phase; B |
ΔrH° | 6.80 | kcal/mol | TDAs | Hiraoka, Shoda, et al., 1986 | gas phase; B,M |
Quantity | Value | Units | Method | Reference | Comment |
ΔrS° | 22.4 | cal/mol*K | PHPMS | Hiraoka, Shoda, et al., 1986 | gas phase; M |
Quantity | Value | Units | Method | Reference | Comment |
ΔrG° | 0.1 ± 2.0 | kcal/mol | TDAs | Hiraoka, Mizuse, et al., 1987 | gas phase; B |
ΔrG° | 0.10 | kcal/mol | TDAs | Hiraoka, Shoda, et al., 1986 | gas phase; B |
By formula: (Cl- • 3CO2) + CO2 = (Cl- • 4CO2)
Quantity | Value | Units | Method | Reference | Comment |
---|---|---|---|---|---|
ΔrH° | 6.40 | kcal/mol | TDAs | Hiraoka, Shoda, et al., 1986 | gas phase; entropy estimated.; B,M |
Quantity | Value | Units | Method | Reference | Comment |
ΔrS° | 24. | cal/mol*K | N/A | Hiraoka, Shoda, et al., 1986 | gas phase; Entropy change calculated or estimated; M |
Quantity | Value | Units | Method | Reference | Comment |
ΔrG° | -0.80 | kcal/mol | TDAs | Hiraoka, Shoda, et al., 1986 | gas phase; entropy estimated.; B |
By formula: Cl- + CS2 = (Cl- • CS2)
Quantity | Value | Units | Method | Reference | Comment |
---|---|---|---|---|---|
ΔrH° | 8.80 ± 0.20 | kcal/mol | TDAs | Hiraoka, Fujimaki, et al., 1993 | gas phase; B,M |
ΔrH° | 11.7 ± 2.0 | kcal/mol | IMRE | Larson and McMahon, 1985 | gas phase; B,M |
Quantity | Value | Units | Method | Reference | Comment |
ΔrS° | 13.9 | cal/mol*K | PHPMS | Hiraoka, Fujimaki, et al., 1993 | gas phase; M |
ΔrS° | 20. | cal/mol*K | N/A | Larson and McMahon, 1985 | gas phase; switching reaction,Thermochemical ladder(Cl-)t-C4H9OH, Entropy change calculated or estimated; M |
Quantity | Value | Units | Method | Reference | Comment |
ΔrG° | 4.6 ± 2.2 | kcal/mol | TDAs | Hiraoka, Fujimaki, et al., 1993 | gas phase; B |
ΔrG° | 5.7 ± 2.0 | kcal/mol | IMRE | Larson and McMahon, 1985 | gas phase; B,M |
By formula: (Cl- • CS2) + CS2 = (Cl- • 2CS2)
Quantity | Value | Units | Method | Reference | Comment |
---|---|---|---|---|---|
ΔrH° | 7.70 ± 0.20 | kcal/mol | TDAs | Hiraoka, Fujimaki, et al., 1993 | gas phase; B,M |
Quantity | Value | Units | Method | Reference | Comment |
ΔrS° | 15.8 | cal/mol*K | PHPMS | Hiraoka, Fujimaki, et al., 1993 | gas phase; M |
Quantity | Value | Units | Method | Reference | Comment |
ΔrG° | 3.0 ± 1.0 | kcal/mol | TDAs | Hiraoka, Fujimaki, et al., 1993 | gas phase; B |
By formula: (Cl- • 2CS2) + CS2 = (Cl- • 3CS2)
Quantity | Value | Units | Method | Reference | Comment |
---|---|---|---|---|---|
ΔrH° | 7.20 ± 0.20 | kcal/mol | TDAs | Hiraoka, Fujimaki, et al., 1993 | gas phase; B,M |
Quantity | Value | Units | Method | Reference | Comment |
ΔrS° | 21.3 | cal/mol*K | PHPMS | Hiraoka, Fujimaki, et al., 1993 | gas phase; M |
Quantity | Value | Units | Method | Reference | Comment |
ΔrG° | 0.8 ± 1.0 | kcal/mol | TDAs | Hiraoka, Fujimaki, et al., 1993 | gas phase; B |
By formula: (Cl- • 3CS2) + CS2 = (Cl- • 4CS2)
Quantity | Value | Units | Method | Reference | Comment |
---|---|---|---|---|---|
ΔrH° | 6.8 ± 1.0 | kcal/mol | TDAs | Hiraoka, Fujimaki, et al., 1993 | gas phase; Estimated entropy; single temperature measurement; B |
Quantity | Value | Units | Method | Reference | Comment |
ΔrG° | -0.1 ± 1.0 | kcal/mol | TDAs | Hiraoka, Fujimaki, et al., 1993 | gas phase; Estimated entropy; single temperature measurement; B |
By formula: Cl- + C2ClF3O = (Cl- • C2ClF3O)
Quantity | Value | Units | Method | Reference | Comment |
---|---|---|---|---|---|
ΔrH° | 17.8 ± 2.0 | kcal/mol | IMRE | Larson and McMahon, 1985 | gas phase; B,M |
Quantity | Value | Units | Method | Reference | Comment |
ΔrS° | 22. | cal/mol*K | N/A | Larson and McMahon, 1985 | gas phase; switching reaction,Thermochemical ladder(Cl-)t-C4H9OH, Entropy change calculated or estimated; M |
Quantity | Value | Units | Method | Reference | Comment |
ΔrG° | 11.2 ± 2.0 | kcal/mol | IMRE | Larson and McMahon, 1985 | gas phase; B,M |
By formula: Cl- + C2F4O = (Cl- • C2F4O)
Quantity | Value | Units | Method | Reference | Comment |
---|---|---|---|---|---|
ΔrH° | 16.7 ± 2.0 | kcal/mol | IMRE | Larson and McMahon, 1985 | gas phase; B,M |
Quantity | Value | Units | Method | Reference | Comment |
ΔrS° | 22. | cal/mol*K | N/A | Larson and McMahon, 1985 | gas phase; switching reaction,Thermochemical ladder(Cl-)t-C4H9OH, Entropy change calculated or estimated; M |
Quantity | Value | Units | Method | Reference | Comment |
ΔrG° | 10.1 ± 2.0 | kcal/mol | IMRE | Larson and McMahon, 1985 | gas phase; B,M |
+
= C2ClF4-
By formula: Cl- + C2F4 = C2ClF4-
Quantity | Value | Units | Method | Reference | Comment |
---|---|---|---|---|---|
ΔrH° | >10.00 | kcal/mol | TDAs | Hiraoka, Mochizuki, et al., 2008 | gas phase; Entropy estimated. The experimental HOF of C2F4 has been quiestioned as being too positive: Curtiss, Raghavachari, et al., 7374, 11CHA/DEN; B |
Quantity | Value | Units | Method | Reference | Comment |
ΔrG° | 2.55 | kcal/mol | TDAs | Hiraoka, Mochizuki, et al., 2008 | gas phase; Entropy estimated. The experimental HOF of C2F4 has been quiestioned as being too positive: Curtiss, Raghavachari, et al., 7374, 11CHA/DEN; B |
By formula: Cl- + C2HF5O = (Cl- • C2HF5O)
Quantity | Value | Units | Method | Reference | Comment |
---|---|---|---|---|---|
ΔrH° | 17.50 ± 0.40 | kcal/mol | TDAs | Bogdanov, Lee, et al., 2001 | gas phase; B |
Quantity | Value | Units | Method | Reference | Comment |
ΔrG° | 11.3 ± 1.0 | kcal/mol | TDAs | Bogdanov, Lee, et al., 2001 | gas phase; B |
ΔrG° | 12.1 ± 2.0 | kcal/mol | IMRE | Larson and McMahon, 1984, 3 | gas phase; B,M |
By formula: Cl- + C2HF5 = (Cl- • C2HF5)
Quantity | Value | Units | Method | Reference | Comment |
---|---|---|---|---|---|
ΔrH° | 18.8 ± 2.0 | kcal/mol | IMRE | Larson and McMahon, 1984, 2 | gas phase; B,M |
Quantity | Value | Units | Method | Reference | Comment |
ΔrS° | 23.3 | cal/mol*K | N/A | Larson and McMahon, 1984 | gas phase; switching reaction(Cl-)t-C4H9OH, Entropy change calculated or estimated; French, Ikuta, et al., 1982; M |
Quantity | Value | Units | Method | Reference | Comment |
ΔrG° | 11.8 ± 2.0 | kcal/mol | IMRE | Larson and McMahon, 1984, 2 | gas phase; B,M |
By formula: Cl- + C2H2F4O = (Cl- • C2H2F4O)
Quantity | Value | Units | Method | Reference | Comment |
---|---|---|---|---|---|
ΔrH° | 28.20 ± 0.40 | kcal/mol | TDAs | Bogdanov, Lee, et al., 2001 | gas phase; B |
Quantity | Value | Units | Method | Reference | Comment |
ΔrG° | 18.8 ± 1.0 | kcal/mol | TDAs | Bogdanov, Lee, et al., 2001 | gas phase; B |
ΔrG° | 17.0 ± 2.0 | kcal/mol | IMRE | Larson and McMahon, 1984, 3 | gas phase; B,M |
By formula: Cl- + C2H3ClO2 = (Cl- • C2H3ClO2)
Quantity | Value | Units | Method | Reference | Comment |
---|---|---|---|---|---|
ΔrH° | 14.1 ± 2.0 | kcal/mol | IMRE | Larson and McMahon, 1985 | gas phase; B |
Quantity | Value | Units | Method | Reference | Comment |
ΔrG° | 7.8 ± 2.0 | kcal/mol | IMRE | Larson and McMahon, 1985 | gas phase; B |
By formula: Cl- + C2H3ClO2 = (Cl- • C2H3ClO2)
Quantity | Value | Units | Method | Reference | Comment |
---|---|---|---|---|---|
ΔrH° | 14.1 | kcal/mol | ICR | Larson and McMahon, 1984 | gas phase; switching reaction(Cl-)t-C4H9OH, Entropy change calculated or estimated; French, Ikuta, et al., 1982; M |
Quantity | Value | Units | Method | Reference | Comment |
ΔrS° | 21.0 | cal/mol*K | N/A | Larson and McMahon, 1984 | gas phase; switching reaction(Cl-)t-C4H9OH, Entropy change calculated or estimated; French, Ikuta, et al., 1982; M |
Quantity | Value | Units | Method | Reference | Comment |
ΔrG° | 7.8 | kcal/mol | ICR | Larson and McMahon, 1984 | gas phase; switching reaction(Cl-)t-C4H9OH, Entropy change calculated or estimated; French, Ikuta, et al., 1982; M |
By formula: Cl- + C2H3F3O = (Cl- • C2H3F3O)
Quantity | Value | Units | Method | Reference | Comment |
---|---|---|---|---|---|
ΔrH° | 24.0 ± 2.0 | kcal/mol | IMRE | Larson and McMahon, 1984, 2 | gas phase; B,M |
Quantity | Value | Units | Method | Reference | Comment |
ΔrS° | 25.0 | cal/mol*K | N/A | Larson and McMahon, 1984, 2 | gas phase; switching reaction(Cl-)CH3COOH, Entropy change calculated or estimated; Larson and McMahon, 1984; M |
Quantity | Value | Units | Method | Reference | Comment |
ΔrG° | 16.5 ± 2.0 | kcal/mol | IMRE | Larson and McMahon, 1984, 2 | gas phase; B,M |
By formula: Cl- + C2H3F3 = (Cl- • C2H3F3)
Quantity | Value | Units | Method | Reference | Comment |
---|---|---|---|---|---|
ΔrH° | 18.9 | kcal/mol | ICR | Larson and McMahon, 1984, 2 | gas phase; switching reaction(Cl-)t-C4H9OH, Entropy change calculated or estimated; Larson and McMahon, 1984; M |
Quantity | Value | Units | Method | Reference | Comment |
ΔrS° | 25.0 | cal/mol*K | N/A | Larson and McMahon, 1984, 2 | gas phase; switching reaction(Cl-)t-C4H9OH, Entropy change calculated or estimated; Larson and McMahon, 1984; M |
Quantity | Value | Units | Method | Reference | Comment |
ΔrG° | 11.4 | kcal/mol | ICR | Larson and McMahon, 1984, 2 | gas phase; switching reaction(Cl-)t-C4H9OH, Entropy change calculated or estimated; Larson and McMahon, 1984; M |
By formula: Cl- + C2H3N = (Cl- • C2H3N)
Quantity | Value | Units | Method | Reference | Comment |
---|---|---|---|---|---|
ΔrH° | 15. ± 2. | kcal/mol | AVG | N/A | Average of 6 values; Individual data points |
Quantity | Value | Units | Method | Reference | Comment |
ΔrS° | 15.7 | cal/mol*K | PHPMS | Hiraoka, Mizuse, et al., 1988, 2 | gas phase; M |
ΔrS° | 15.7 | cal/mol*K | PHPMS | Yamabe, Furumiya, et al., 1986 | gas phase; M |
ΔrS° | 14.3 | cal/mol*K | PHPMS | Sieck, 1985 | gas phase; M |
ΔrS° | 14.3 | cal/mol*K | PHPMS | Yamdagni and Kebarle, 1972 | gas phase; M |
ΔrS° | 21.4 | cal/mol*K | N/A | Larson and McMahon, 1984, 2 | gas phase; switching reaction(Cl-)CF3H, Entropy change calculated or estimated; Larson and McMahon, 1984; M |
Quantity | Value | Units | Method | Reference | Comment |
ΔrG° | 10.20 ± 0.20 | kcal/mol | TDAs | Li, Ross, et al., 1996 | gas phase; B |
ΔrG° | 9.2 ± 2.0 | kcal/mol | TDAs | Hiraoka, Mizuse, et al., 1988, 2 | gas phase; B |
ΔrG° | 8.9 ± 2.6 | kcal/mol | TDAs | Yamabe, Furumiya, et al., 1986 | gas phase; B |
ΔrG° | 10.10 ± 0.20 | kcal/mol | TDAs | Sieck, 1985 | gas phase; B |
ΔrG° | 9.2 ± 2.0 | kcal/mol | TDAs | Yamdagni and Kebarle, 1972 | gas phase; B |
By formula: (Cl- • C2H3N) + C2H3N = (Cl- • 2C2H3N)
Quantity | Value | Units | Method | Reference | Comment |
---|---|---|---|---|---|
ΔrH° | 12.50 ± 0.40 | kcal/mol | TDAs | Hiraoka, Mizuse, et al., 1988, 2 | gas phase; B,M |
ΔrH° | 12.00 ± 0.70 | kcal/mol | N/A | Markovich, Perera, et al., 1996 | gas phase; B |
ΔrH° | 12.20 | kcal/mol | TDAs | Yamdagni and Kebarle, 1972 | gas phase; B,M |
Quantity | Value | Units | Method | Reference | Comment |
ΔrS° | 16.3 | cal/mol*K | PHPMS | Hiraoka, Mizuse, et al., 1988, 2 | gas phase; M |
ΔrS° | 18.9 | cal/mol*K | PHPMS | Yamdagni and Kebarle, 1972 | gas phase; M |
Quantity | Value | Units | Method | Reference | Comment |
ΔrG° | 7.6 ± 1.2 | kcal/mol | TDAs | Hiraoka, Mizuse, et al., 1988, 2 | gas phase; B |
ΔrG° | 6.60 | kcal/mol | TDAs | Yamdagni and Kebarle, 1972 | gas phase; B |
By formula: (Cl- • 2C2H3N) + C2H3N = (Cl- • 3C2H3N)
Quantity | Value | Units | Method | Reference | Comment |
---|---|---|---|---|---|
ΔrH° | 11.20 ± 0.40 | kcal/mol | TDAs | Hiraoka, Mizuse, et al., 1988, 2 | gas phase; B,M |
ΔrH° | 12.00 ± 0.70 | kcal/mol | N/A | Markovich, Perera, et al., 1996 | gas phase; B |
ΔrH° | 10.60 | kcal/mol | TDAs | Yamdagni and Kebarle, 1972 | gas phase; B,M |
Quantity | Value | Units | Method | Reference | Comment |
ΔrS° | 19.6 | cal/mol*K | PHPMS | Hiraoka, Mizuse, et al., 1988, 2 | gas phase; M |
ΔrS° | 20.1 | cal/mol*K | PHPMS | Yamdagni and Kebarle, 1972 | gas phase; M |
Quantity | Value | Units | Method | Reference | Comment |
ΔrG° | 5.3 ± 1.3 | kcal/mol | TDAs | Hiraoka, Mizuse, et al., 1988, 2 | gas phase; B |
ΔrG° | 4.60 | kcal/mol | TDAs | Yamdagni and Kebarle, 1972 | gas phase; B |
By formula: (Cl- • 3C2H3N) + C2H3N = (Cl- • 4C2H3N)
Quantity | Value | Units | Method | Reference | Comment |
---|---|---|---|---|---|
ΔrH° | 10.90 ± 0.30 | kcal/mol | TDAs | Hiraoka, Mizuse, et al., 1988, 2 | gas phase; B,M |
ΔrH° | 9.00 ± 0.80 | kcal/mol | N/A | Markovich, Perera, et al., 1996 | gas phase; B |
ΔrH° | 6.20 | kcal/mol | TDAs | Yamdagni and Kebarle, 1972 | gas phase; B,M |
Quantity | Value | Units | Method | Reference | Comment |
ΔrS° | 26.6 | cal/mol*K | PHPMS | Hiraoka, Mizuse, et al., 1988, 2 | gas phase; M |
ΔrS° | 10.8 | cal/mol*K | PHPMS | Yamdagni and Kebarle, 1972 | gas phase; Entropy change is questionable; M |
Quantity | Value | Units | Method | Reference | Comment |
ΔrG° | 2.9 ± 1.2 | kcal/mol | TDAs | Hiraoka, Mizuse, et al., 1988, 2 | gas phase; B |
ΔrG° | 3.00 | kcal/mol | TDAs | Yamdagni and Kebarle, 1972 | gas phase; B |
By formula: (Cl- • 4C2H3N) + C2H3N = (Cl- • 5C2H3N)
Quantity | Value | Units | Method | Reference | Comment |
---|---|---|---|---|---|
ΔrH° | 9.80 ± 0.20 | kcal/mol | TDAs | Hiraoka, Mizuse, et al., 1988, 2 | gas phase; B,M |
ΔrH° | 5.80 ± 0.90 | kcal/mol | N/A | Markovich, Perera, et al., 1996 | gas phase; B |
Quantity | Value | Units | Method | Reference | Comment |
ΔrS° | 27.1 | cal/mol*K | PHPMS | Hiraoka, Mizuse, et al., 1988, 2 | gas phase; M |
Quantity | Value | Units | Method | Reference | Comment |
ΔrG° | 1.70 ± 0.80 | kcal/mol | TDAs | Hiraoka, Mizuse, et al., 1988, 2 | gas phase; B |
By formula: (Cl- • 5C2H3N) + C2H3N = (Cl- • 6C2H3N)
Quantity | Value | Units | Method | Reference | Comment |
---|---|---|---|---|---|
ΔrH° | 9.50 ± 0.20 | kcal/mol | TDAs | Hiraoka, Mizuse, et al., 1988, 2 | gas phase; B,M |
ΔrH° | 5.8 ± 1.0 | kcal/mol | N/A | Markovich, Perera, et al., 1996 | gas phase; B |
Quantity | Value | Units | Method | Reference | Comment |
ΔrS° | 29.1 | cal/mol*K | PHPMS | Hiraoka, Mizuse, et al., 1988, 2 | gas phase; M |
Quantity | Value | Units | Method | Reference | Comment |
ΔrG° | 0.80 ± 0.80 | kcal/mol | TDAs | Hiraoka, Mizuse, et al., 1988, 2 | gas phase; B |
By formula: (Cl- • 6C2H3N) + C2H3N = (Cl- • 7C2H3N)
Quantity | Value | Units | Method | Reference | Comment |
---|---|---|---|---|---|
ΔrH° | 9.40 ± 0.30 | kcal/mol | TDAs | Hiraoka, Mizuse, et al., 1988, 2 | gas phase; B,M |
ΔrH° | 3.9 ± 1.1 | kcal/mol | N/A | Markovich, Perera, et al., 1996 | gas phase; B |
Quantity | Value | Units | Method | Reference | Comment |
ΔrS° | 30.7 | cal/mol*K | PHPMS | Hiraoka, Mizuse, et al., 1988, 2 | gas phase; M |
Quantity | Value | Units | Method | Reference | Comment |
ΔrG° | 0.2 ± 1.4 | kcal/mol | TDAs | Hiraoka, Mizuse, et al., 1988, 2 | gas phase; B |
By formula: (Cl- • 7C2H3N) + C2H3N = (Cl- • 8C2H3N)
Quantity | Value | Units | Method | Reference | Comment |
---|---|---|---|---|---|
ΔrH° | 9.20 | kcal/mol | TDAs | Hiraoka, Mizuse, et al., 1988, 2 | gas phase; Entropy estimated; B,M |
ΔrH° | 2.8 ± 1.2 | kcal/mol | N/A | Markovich, Perera, et al., 1996 | gas phase; B |
Quantity | Value | Units | Method | Reference | Comment |
ΔrS° | 32. | cal/mol*K | N/A | Hiraoka, Mizuse, et al., 1988, 2 | gas phase; Entropy change calculated or estimated; M |
Quantity | Value | Units | Method | Reference | Comment |
ΔrG° | -0.40 | kcal/mol | TDAs | Hiraoka, Mizuse, et al., 1988, 2 | gas phase; Entropy estimated; B |
By formula: (Cl- • 8C2H3N) + C2H3N = (Cl- • 9C2H3N)
Quantity | Value | Units | Method | Reference | Comment |
---|---|---|---|---|---|
ΔrH° | 4.4 ± 1.4 | kcal/mol | N/A | Markovich, Perera, et al., 1996 | gas phase; B |
By formula: (Cl- • 9C2H3N) + C2H3N = (Cl- • 10C2H3N)
Quantity | Value | Units | Method | Reference | Comment |
---|---|---|---|---|---|
ΔrH° | 2.1 ± 1.5 | kcal/mol | N/A | Markovich, Perera, et al., 1996 | gas phase; B |
By formula: (Cl- • 10C2H3N) + C2H3N = (Cl- • 11C2H3N)
Quantity | Value | Units | Method | Reference | Comment |
---|---|---|---|---|---|
ΔrH° | 1.8 ± 1.6 | kcal/mol | N/A | Markovich, Perera, et al., 1996 | gas phase; B |
By formula: (Cl- • 11C2H3N) + C2H3N = (Cl- • 12C2H3N)
Quantity | Value | Units | Method | Reference | Comment |
---|---|---|---|---|---|
ΔrH° | -0.5 ± 1.7 | kcal/mol | N/A | Markovich, Perera, et al., 1996 | gas phase; B |
By formula: (Cl- • 12C2H3N) + C2H3N = (Cl- • 13C2H3N)
Quantity | Value | Units | Method | Reference | Comment |
---|---|---|---|---|---|
ΔrH° | 0.9 ± 1.8 | kcal/mol | N/A | Markovich, Perera, et al., 1996 | gas phase; B |
By formula: (Cl- • 13C2H3N) + C2H3N = (Cl- • 14C2H3N)
Quantity | Value | Units | Method | Reference | Comment |
---|---|---|---|---|---|
ΔrH° | -0.5 ± 1.9 | kcal/mol | N/A | Markovich, Perera, et al., 1996 | gas phase; B |
By formula: Cl- + C2H4F2 = (Cl- • C2H4F2)
Quantity | Value | Units | Method | Reference | Comment |
---|---|---|---|---|---|
ΔrH° | 14.9 ± 2.0 | kcal/mol | IMRE | Larson and McMahon, 1984, 2 | gas phase; B,M |
Quantity | Value | Units | Method | Reference | Comment |
ΔrS° | 22.7 | cal/mol*K | N/A | Larson and McMahon, 1984, 2 | gas phase; switching reaction(Cl-)CF3H, Entropy change calculated or estimated; Larson and McMahon, 1984; M |
Quantity | Value | Units | Method | Reference | Comment |
ΔrG° | 8.1 ± 2.0 | kcal/mol | IMRE | Larson and McMahon, 1984, 2 | gas phase; B,M |
By formula: Cl- + C2H4F3N = (Cl- • C2H4F3N)
Quantity | Value | Units | Method | Reference | Comment |
---|---|---|---|---|---|
ΔrH° | 18.0 ± 2.0 | kcal/mol | IMRE | Larson and McMahon, 1984, 2 | gas phase; B,M |
Quantity | Value | Units | Method | Reference | Comment |
ΔrS° | 24.0 | cal/mol*K | N/A | Larson and McMahon, 1984, 2 | gas phase; switching reaction(Cl-)CF3H, Entropy change calculated or estimated; Larson and McMahon, 1984; M |
Quantity | Value | Units | Method | Reference | Comment |
ΔrG° | 10.8 ± 2.0 | kcal/mol | IMRE | Larson and McMahon, 1984, 2 | gas phase; B,M |
By formula: Cl- + C2H4O = (Cl- • C2H4O)
Quantity | Value | Units | Method | Reference | Comment |
---|---|---|---|---|---|
ΔrH° | 14.4 ± 2.0 | kcal/mol | IMRE | Larson and McMahon, 1984, 2 | gas phase; B,M |
Quantity | Value | Units | Method | Reference | Comment |
ΔrS° | 21.7 | cal/mol*K | N/A | Larson and McMahon, 1984, 2 | gas phase; switching reaction(Cl-)t-C4H9F, Entropy change calculated or estimated; Larson and McMahon, 1984; M |
Quantity | Value | Units | Method | Reference | Comment |
ΔrG° | 7.9 ± 2.0 | kcal/mol | IMRE | Larson and McMahon, 1984, 2 | gas phase; B,M |
By formula: Cl- + C2H4O2 = (Cl- • C2H4O2)
Quantity | Value | Units | Method | Reference | Comment |
---|---|---|---|---|---|
ΔrH° | 24.40 ± 0.20 | kcal/mol | TDAs | Sieck, 1985 | gas phase; B,M |
ΔrH° | 21.6 ± 2.0 | kcal/mol | TDAs | Yamdagni and Kebarle, 1971 | gas phase; B,M |
ΔrH° | 23.9 ± 2.0 | kcal/mol | IMRE | Larson and McMahon, 1984, 2 | gas phase; B,M |
Quantity | Value | Units | Method | Reference | Comment |
ΔrS° | 19.6 | cal/mol*K | PHPMS | Sieck, 1985 | gas phase; M |
ΔrS° | 24.0 | cal/mol*K | N/A | Larson and McMahon, 1984 | gas phase; switching reaction(Cl-)t-C4H9OH, Entropy change calculated or estimated; French, Ikuta, et al., 1982; M |
ΔrS° | 19.3 | cal/mol*K | PHPMS | Yamdagni and Kebarle, 1971 | gas phase; M |
Quantity | Value | Units | Method | Reference | Comment |
ΔrG° | 18.60 ± 0.30 | kcal/mol | TDAs | Sieck, 1985 | gas phase; B |
ΔrG° | 15.8 ± 2.0 | kcal/mol | TDAs | Yamdagni and Kebarle, 1971 | gas phase; B |
ΔrG° | 16.7 ± 2.0 | kcal/mol | IMRE | Larson and McMahon, 1984, 2 | gas phase; B,M |
By formula: Cl- + C2H5Br = (Cl- • C2H5Br)
Quantity | Value | Units | Method | Reference | Comment |
---|---|---|---|---|---|
ΔrH° | 13.6 ± 1.0 | kcal/mol | TDAs | Li, Ross, et al., 1996 | gas phase; B |
Quantity | Value | Units | Method | Reference | Comment |
ΔrG° | 6.92 ± 0.20 | kcal/mol | TDAs | Li, Ross, et al., 1996 | gas phase; B |
By formula: Cl- + C2H5ClO = (Cl- • C2H5ClO)
Quantity | Value | Units | Method | Reference | Comment |
---|---|---|---|---|---|
ΔrH° | 21.5 ± 2.0 | kcal/mol | IMRE | Larson and McMahon, 1984, 2 | gas phase; B,M |
Quantity | Value | Units | Method | Reference | Comment |
ΔrS° | 25.0 | cal/mol*K | N/A | Larson and McMahon, 1984, 2 | gas phase; switching reaction(Cl-)FCH2CH2OH, Entropy change calculated or estimated; Larson and McMahon, 1984; M |
Quantity | Value | Units | Method | Reference | Comment |
ΔrG° | 14.0 ± 2.0 | kcal/mol | IMRE | Larson and McMahon, 1984, 2 | gas phase; B,M |
By formula: Cl- + C2H5Cl = (Cl- • C2H5Cl)
Quantity | Value | Units | Method | Reference | Comment |
---|---|---|---|---|---|
ΔrH° | 12.4 ± 1.0 | kcal/mol | TDAs | Li, Ross, et al., 1996 | gas phase; B |
ΔrH° | 14.5 ± 4.5 | kcal/mol | IMRB | Riveros, Breda, et al., 1973 | gas phase; Anchored: Larson and McMahon, 1984, 3; B |
Quantity | Value | Units | Method | Reference | Comment |
ΔrG° | 6.80 ± 0.20 | kcal/mol | TDAs | Li, Ross, et al., 1996 | gas phase; B |
By formula: Cl- + C2H5FO = (Cl- • C2H5FO)
Quantity | Value | Units | Method | Reference | Comment |
---|---|---|---|---|---|
ΔrH° | 20.5 ± 2.0 | kcal/mol | IMRE | Larson and McMahon, 1984, 2 | gas phase; B,M |
Quantity | Value | Units | Method | Reference | Comment |
ΔrS° | 25.0 | cal/mol*K | N/A | Larson and McMahon, 1984 | gas phase; switching reaction(Cl-)t-C4H9OH, Entropy change calculated or estimated; French, Ikuta, et al., 1982; M |
Quantity | Value | Units | Method | Reference | Comment |
ΔrG° | 13.0 ± 2.0 | kcal/mol | IMRE | Larson and McMahon, 1984, 2 | gas phase; B,M |
By formula: Cl- + C2H6OS = (Cl- • C2H6OS)
Quantity | Value | Units | Method | Reference | Comment |
---|---|---|---|---|---|
ΔrH° | 18.60 | kcal/mol | TDAs | Magnera, Caldwell, et al., 1984 | gas phase; B,M |
Quantity | Value | Units | Method | Reference | Comment |
ΔrS° | 20.4 | cal/mol*K | PHPMS | Magnera, Caldwell, et al., 1984 | gas phase; M |
Quantity | Value | Units | Method | Reference | Comment |
ΔrG° | 12.50 | kcal/mol | TDAs | Magnera, Caldwell, et al., 1984 | gas phase; B |
By formula: (Cl- • C2H6OS) + C2H6OS = (Cl- • 2C2H6OS)
Quantity | Value | Units | Method | Reference | Comment |
---|---|---|---|---|---|
ΔrH° | 16.0 | kcal/mol | PHPMS | Magnera, Caldwell, et al., 1984 | gas phase; M |
Quantity | Value | Units | Method | Reference | Comment |
ΔrS° | 23.8 | cal/mol*K | PHPMS | Magnera, Caldwell, et al., 1984 | gas phase; M |
By formula: (Cl- • 2C2H6OS) + C2H6OS = (Cl- • 3C2H6OS)
Quantity | Value | Units | Method | Reference | Comment |
---|---|---|---|---|---|
ΔrH° | 14.9 | kcal/mol | PHPMS | Magnera, Caldwell, et al., 1984 | gas phase; M |
Quantity | Value | Units | Method | Reference | Comment |
ΔrS° | 29.8 | cal/mol*K | PHPMS | Magnera, Caldwell, et al., 1984 | gas phase; M |
By formula: (Cl- • 3C2H6OS) + C2H6OS = (Cl- • 4C2H6OS)
Quantity | Value | Units | Method | Reference | Comment |
---|---|---|---|---|---|
ΔrH° | 14.6 | kcal/mol | PHPMS | Magnera, Caldwell, et al., 1984 | gas phase; M |
Quantity | Value | Units | Method | Reference | Comment |
ΔrS° | 37.2 | cal/mol*K | PHPMS | Magnera, Caldwell, et al., 1984 | gas phase; M |
By formula: (Cl- • 4C2H6OS) + C2H6OS = (Cl- • 5C2H6OS)
Quantity | Value | Units | Method | Reference | Comment |
---|---|---|---|---|---|
ΔrH° | 13.8 | kcal/mol | PHPMS | Magnera, Caldwell, et al., 1984 | gas phase; M |
Quantity | Value | Units | Method | Reference | Comment |
ΔrS° | 40.2 | cal/mol*K | PHPMS | Magnera, Caldwell, et al., 1984 | gas phase; M |
By formula: Cl- + C2H6O = (Cl- • C2H6O)
Quantity | Value | Units | Method | Reference | Comment |
---|---|---|---|---|---|
ΔrH° | 17.90 ± 0.40 | kcal/mol | TDAs | Bogdanov, Peschke, et al., 1999 | gas phase; B |
ΔrH° | 17.60 ± 0.50 | kcal/mol | TDAs | Hiraoka, 1987 | gas phase; B,B,M |
ΔrH° | 17.3 ± 2.0 | kcal/mol | IMRE | Larson and McMahon, 1984, 2 | gas phase; B,M |
Quantity | Value | Units | Method | Reference | Comment |
ΔrS° | 23.7 | cal/mol*K | PHPMS | Hiraoka and Mizuse, 1987 | gas phase; M |
ΔrS° | 23.1 | cal/mol*K | N/A | Larson and McMahon, 1984, 2 | gas phase; switching reaction(Cl-)t-C4H9OH, Entropy change calculated or estimated; Larson and McMahon, 1984; M |
Quantity | Value | Units | Method | Reference | Comment |
ΔrG° | 10.65 | kcal/mol | TDAs | Bogdanov, Peschke, et al., 1999 | gas phase; B |
ΔrG° | 10.5 ± 2.0 | kcal/mol | TDAs | Hiraoka and Mizuse, 1987 | gas phase; B |
ΔrG° | 10.5 ± 2.0 | kcal/mol | TDAs | Hiraoka, 1987 | gas phase; B |
ΔrG° | 10.4 ± 2.0 | kcal/mol | IMRE | Larson and McMahon, 1984, 2 | gas phase; B,M |
Free energy of reaction
ΔrG° (kcal/mol) | T (K) | Method | Reference | Comment |
---|---|---|---|---|
10.0 | 295. | ICR | Riveros, 1974 | gas phase; switching reaction(Cl-)CH3OH; Riveros, Breda, et al., 1973; M |
By formula: (Cl- • C2H6O) + C2H6O = (Cl- • 2C2H6O)
Quantity | Value | Units | Method | Reference | Comment |
---|---|---|---|---|---|
ΔrH° | 15.30 ± 0.20 | kcal/mol | TDAs | Bogdanov, Peschke, et al., 1999 | gas phase; B |
ΔrH° | 16.1 ± 1.0 | kcal/mol | TDAs | Hiraoka and Mizuse, 1987 | gas phase; B,M |
Quantity | Value | Units | Method | Reference | Comment |
ΔrS° | 25.9 | cal/mol*K | PHPMS | Hiraoka and Mizuse, 1987 | gas phase; M |
Quantity | Value | Units | Method | Reference | Comment |
ΔrG° | 7.34 | kcal/mol | TDAs | Bogdanov, Peschke, et al., 1999 | gas phase; B |
ΔrG° | 8.3 ± 1.0 | kcal/mol | TDAs | Hiraoka and Mizuse, 1987 | gas phase; B |
By formula: (Cl- • 2C2H6O) + C2H6O = (Cl- • 3C2H6O)
Quantity | Value | Units | Method | Reference | Comment |
---|---|---|---|---|---|
ΔrH° | 13.90 ± 0.70 | kcal/mol | TDAs | Bogdanov, Peschke, et al., 1999 | gas phase; B |
ΔrH° | 12.8 ± 1.0 | kcal/mol | TDAs | Hiraoka and Mizuse, 1987 | gas phase; B,M |
Quantity | Value | Units | Method | Reference | Comment |
ΔrS° | 25.8 | cal/mol*K | PHPMS | Hiraoka and Mizuse, 1987 | gas phase; M |
Quantity | Value | Units | Method | Reference | Comment |
ΔrG° | 5.16 | kcal/mol | TDAs | Bogdanov, Peschke, et al., 1999 | gas phase; B |
ΔrG° | 5.1 ± 1.0 | kcal/mol | TDAs | Hiraoka and Mizuse, 1987 | gas phase; B |
By formula: (Cl- • 3C2H6O) + C2H6O = (Cl- • 4C2H6O)
Quantity | Value | Units | Method | Reference | Comment |
---|---|---|---|---|---|
ΔrH° | 12.0 ± 1.0 | kcal/mol | TDAs | Hiraoka and Mizuse, 1987 | gas phase; B,M |
Quantity | Value | Units | Method | Reference | Comment |
ΔrS° | 29.5 | cal/mol*K | PHPMS | Hiraoka and Mizuse, 1987 | gas phase; M |
Quantity | Value | Units | Method | Reference | Comment |
ΔrG° | 3.2 ± 1.0 | kcal/mol | TDAs | Hiraoka and Mizuse, 1987 | gas phase; B |
By formula: (Cl- • 4C2H6O) + C2H6O = (Cl- • 5C2H6O)
Quantity | Value | Units | Method | Reference | Comment |
---|---|---|---|---|---|
ΔrH° | 11.5 ± 1.0 | kcal/mol | TDAs | Hiraoka and Mizuse, 1987 | gas phase; B,M |
Quantity | Value | Units | Method | Reference | Comment |
ΔrS° | 30.6 | cal/mol*K | PHPMS | Hiraoka and Mizuse, 1987 | gas phase; M |
Quantity | Value | Units | Method | Reference | Comment |
ΔrG° | 2.3 ± 1.0 | kcal/mol | TDAs | Hiraoka and Mizuse, 1987 | gas phase; B |
By formula: (Cl- • 5C2H6O) + C2H6O = (Cl- • 6C2H6O)
Quantity | Value | Units | Method | Reference | Comment |
---|---|---|---|---|---|
ΔrH° | 11.1 ± 1.0 | kcal/mol | TDAs | Hiraoka and Mizuse, 1987 | gas phase; B,M |
Quantity | Value | Units | Method | Reference | Comment |
ΔrS° | 31.0 | cal/mol*K | PHPMS | Hiraoka and Mizuse, 1987 | gas phase; M |
Quantity | Value | Units | Method | Reference | Comment |
ΔrG° | 1.8 ± 1.0 | kcal/mol | TDAs | Hiraoka and Mizuse, 1987 | gas phase; B |
By formula: (Cl- • 6C2H6O) + C2H6O = (Cl- • 7C2H6O)
Quantity | Value | Units | Method | Reference | Comment |
---|---|---|---|---|---|
ΔrH° | 9.8 ± 1.0 | kcal/mol | TDAs | Hiraoka and Mizuse, 1987 | gas phase; B,M |
Quantity | Value | Units | Method | Reference | Comment |
ΔrS° | 26.9 | cal/mol*K | PHPMS | Hiraoka and Mizuse, 1987 | gas phase; M |
Quantity | Value | Units | Method | Reference | Comment |
ΔrG° | 1.7 ± 1.0 | kcal/mol | TDAs | Hiraoka and Mizuse, 1987 | gas phase; B |
By formula: (Cl- • 7C2H6O) + C2H6O = (Cl- • 8C2H6O)
Quantity | Value | Units | Method | Reference | Comment |
---|---|---|---|---|---|
ΔrH° | 9.2 ± 1.0 | kcal/mol | TDAs | Hiraoka and Mizuse, 1987 | gas phase; B,M |
Quantity | Value | Units | Method | Reference | Comment |
ΔrS° | 25.2 | cal/mol*K | PHPMS | Hiraoka and Mizuse, 1987 | gas phase; M |
Quantity | Value | Units | Method | Reference | Comment |
ΔrG° | 1.6 ± 1.0 | kcal/mol | TDAs | Hiraoka and Mizuse, 1987 | gas phase; B |
By formula: (Cl- • 8C2H6O) + C2H6O = (Cl- • 9C2H6O)
Quantity | Value | Units | Method | Reference | Comment |
---|---|---|---|---|---|
ΔrH° | 9.0 ± 1.0 | kcal/mol | TDAs | Hiraoka and Mizuse, 1987 | gas phase; Estimated entropy; single temperature measurement; B,M |
Quantity | Value | Units | Method | Reference | Comment |
ΔrS° | 25. | cal/mol*K | N/A | Hiraoka and Mizuse, 1987 | gas phase; Entropy change calculated or estimated; M |
Quantity | Value | Units | Method | Reference | Comment |
ΔrG° | 1.5 ± 1.0 | kcal/mol | TDAs | Hiraoka and Mizuse, 1987 | gas phase; Estimated entropy; single temperature measurement; B |
By formula: (Cl- • 9C2H6O) + C2H6O = (Cl- • 10C2H6O)
Quantity | Value | Units | Method | Reference | Comment |
---|---|---|---|---|---|
ΔrH° | 8.9 ± 1.0 | kcal/mol | TDAs | Hiraoka and Mizuse, 1987 | gas phase; Estimated entropy; single temperature measurement; B,M |
Quantity | Value | Units | Method | Reference | Comment |
ΔrS° | 25. | cal/mol*K | N/A | Hiraoka and Mizuse, 1987 | gas phase; Entropy change calculated or estimated; M |
Quantity | Value | Units | Method | Reference | Comment |
ΔrG° | 1.4 ± 1.0 | kcal/mol | TDAs | Hiraoka and Mizuse, 1987 | gas phase; Estimated entropy; single temperature measurement; B |
+
= C2H6ClO-
By formula: Cl- + C2H6O = C2H6ClO-
Quantity | Value | Units | Method | Reference | Comment |
---|---|---|---|---|---|
ΔrH° | 7.50 ± 0.40 | kcal/mol | TDAs | Bogdanov, Lee, et al., 2001 | gas phase; B |
Quantity | Value | Units | Method | Reference | Comment |
ΔrG° | 2.9 ± 1.0 | kcal/mol | TDAs | Bogdanov, Lee, et al., 2001 | gas phase; B |
By formula: Cl- + C2H6O2 = (Cl- • C2H6O2)
Quantity | Value | Units | Method | Reference | Comment |
---|---|---|---|---|---|
ΔrH° | 25.3 ± 1.0 | kcal/mol | TDAs | Zhang, Beglinger, et al., 1995 | gas phase; B |
Quantity | Value | Units | Method | Reference | Comment |
ΔrG° | 16.6 ± 1.0 | kcal/mol | TDAs | Zhang, Beglinger, et al., 1995 | gas phase; B |
By formula: (Cl- • C2H6O2) + C2H6O2 = (Cl- • 2C2H6O2)
Quantity | Value | Units | Method | Reference | Comment |
---|---|---|---|---|---|
ΔrH° | 15.9 ± 1.2 | kcal/mol | TDAs | Zhang, Beglinger, et al., 1995 | gas phase; B |
Quantity | Value | Units | Method | Reference | Comment |
ΔrG° | 9.3 ± 1.0 | kcal/mol | TDAs | Zhang, Beglinger, et al., 1995 | gas phase; B |
By formula: Cl- + C3F6O = (Cl- • C3F6O)
Quantity | Value | Units | Method | Reference | Comment |
---|---|---|---|---|---|
ΔrH° | 28.8 ± 1.0 | kcal/mol | TDAs | Bofdanov and McMahon, 2002 | gas phase; B |
ΔrH° | 22.9 ± 2.0 | kcal/mol | IMRE | Larson and McMahon, 1985 | gas phase; B,M |
Quantity | Value | Units | Method | Reference | Comment |
ΔrS° | 22. | cal/mol*K | N/A | Larson and McMahon, 1985 | gas phase; switching reaction,Thermochemical ladder(t-C4H9OH), Entropy change calculated or estimated; M |
Quantity | Value | Units | Method | Reference | Comment |
ΔrG° | 17.6 ± 1.0 | kcal/mol | TDAs | Bofdanov and McMahon, 2002 | gas phase; B |
ΔrG° | 16.3 ± 2.0 | kcal/mol | IMRE | Larson and McMahon, 1985 | gas phase; B,M |
ΔrG° | 16.3 | kcal/mol | ICR | Larson and McMahon, 1984, 3 | gas phase; switching reaction(Cl-)(C2H5)3B; M |
+
= C3ClF6-
By formula: Cl- + C3F6 = C3ClF6-
Quantity | Value | Units | Method | Reference | Comment |
---|---|---|---|---|---|
ΔrH° | 12.60 ± 0.30 | kcal/mol | TDAs | Hiraoka, Takao, et al., 2002 | gas phase; B |
Quantity | Value | Units | Method | Reference | Comment |
ΔrG° | 5.15 ± 0.30 | kcal/mol | TDAs | Hiraoka, Takao, et al., 2002 | gas phase; B |
By formula: Cl- + C3HF5O = (Cl- • C3HF5O)
Quantity | Value | Units | Method | Reference | Comment |
---|---|---|---|---|---|
ΔrH° | 26.1 ± 1.0 | kcal/mol | TDAs | Bofdanov and McMahon, 2002 | gas phase; B |
ΔrH° | 23.4 | kcal/mol | ICR | Larson and McMahon, 1984 | gas phase; switching reaction(Cl-)t-C4H9OH, Entropy change calculated or estimated; French, Ikuta, et al., 1982; M |
Quantity | Value | Units | Method | Reference | Comment |
ΔrS° | 23.9 | cal/mol*K | N/A | Larson and McMahon, 1984 | gas phase; switching reaction(Cl-)t-C4H9OH, Entropy change calculated or estimated; French, Ikuta, et al., 1982; M |
Quantity | Value | Units | Method | Reference | Comment |
ΔrG° | 17.2 ± 1.0 | kcal/mol | TDAs | Bofdanov and McMahon, 2002 | gas phase; B |
ΔrG° | 16.3 ± 2.0 | kcal/mol | IMRE | Larson and McMahon, 1984, 3 | gas phase; B,M,M |
By formula: Cl- + C3H2F4O = (Cl- • C3H2F4O)
Quantity | Value | Units | Method | Reference | Comment |
---|---|---|---|---|---|
ΔrG° | 18.1 ± 2.0 | kcal/mol | IMRE | Larson and McMahon, 1984, 3 | gas phase; B,M |
By formula: Cl- + C3H2F6O = (Cl- • C3H2F6O)
Quantity | Value | Units | Method | Reference | Comment |
---|---|---|---|---|---|
ΔrH° | 26.5 | kcal/mol | ICR | Larson and McMahon, 1984, 2 | gas phase; switching reaction(Cl-)(CF3)2CH3COH, Entropy change calculated or estimated, DG>, ΔrH>; Larson and McMahon, 1984; M |
Quantity | Value | Units | Method | Reference | Comment |
ΔrS° | 25.0 | cal/mol*K | N/A | Larson and McMahon, 1984, 2 | gas phase; switching reaction(Cl-)(CF3)2CH3COH, Entropy change calculated or estimated, DG>, ΔrH>; Larson and McMahon, 1984; M |
Quantity | Value | Units | Method | Reference | Comment |
ΔrG° | 19.0 | kcal/mol | ICR | Larson and McMahon, 1984, 2 | gas phase; switching reaction(Cl-)(CF3)2CH3COH, Entropy change calculated or estimated, DG>, ΔrH>; Larson and McMahon, 1984; M |
+ C3H3F3O- = C2H3ClF3O-
By formula: Cl- + C3H3F3O- = C2H3ClF3O-
Quantity | Value | Units | Method | Reference | Comment |
---|---|---|---|---|---|
ΔrH° | 13.60 ± 0.40 | kcal/mol | TDAs | Bogdanov, Lee, et al., 2001 | gas phase; B |
Quantity | Value | Units | Method | Reference | Comment |
ΔrG° | 7.7 ± 1.0 | kcal/mol | TDAs | Bogdanov, Lee, et al., 2001 | gas phase; B |
+
= C3H3ClF3O-
By formula: Cl- + C3H3F3O = C3H3ClF3O-
Quantity | Value | Units | Method | Reference | Comment |
---|---|---|---|---|---|
ΔrH° | 13.7 ± 1.0 | kcal/mol | TDAs | Bofdanov and McMahon, 2002 | gas phase; B |
Quantity | Value | Units | Method | Reference | Comment |
ΔrG° | 8.2 ± 1.0 | kcal/mol | TDAs | Bofdanov and McMahon, 2002 | gas phase; B |
+
= C3H5ClFO-
By formula: Cl- + C3H5FO = C3H5ClFO-
Quantity | Value | Units | Method | Reference | Comment |
---|---|---|---|---|---|
ΔrH° | 18.4 ± 1.0 | kcal/mol | TDAs | Bofdanov and McMahon, 2002 | gas phase; B |
Quantity | Value | Units | Method | Reference | Comment |
ΔrG° | 11.1 ± 1.0 | kcal/mol | TDAs | Bofdanov and McMahon, 2002 | gas phase; B |
By formula: Cl- + C3H6F2O = (Cl- • C3H6F2O)
Quantity | Value | Units | Method | Reference | Comment |
---|---|---|---|---|---|
ΔrH° | 23.6 | kcal/mol | ICR | Larson and McMahon, 1984, 2 | gas phase; switching reaction(Cl-)CH3COOH, Entropy change calculated or estimated; Larson and McMahon, 1984; M |
Quantity | Value | Units | Method | Reference | Comment |
ΔrS° | 25.0 | cal/mol*K | N/A | Larson and McMahon, 1984, 2 | gas phase; switching reaction(Cl-)CH3COOH, Entropy change calculated or estimated; Larson and McMahon, 1984; M |
Quantity | Value | Units | Method | Reference | Comment |
ΔrG° | 16.1 | kcal/mol | ICR | Larson and McMahon, 1984, 2 | gas phase; switching reaction(Cl-)CH3COOH, Entropy change calculated or estimated; Larson and McMahon, 1984; M |
By formula: Cl- + C3H6O = (Cl- • C3H6O)
Quantity | Value | Units | Method | Reference | Comment |
---|---|---|---|---|---|
ΔrH° | 14. ± 2. | kcal/mol | AVG | N/A | Average of 6 values; Individual data points |
Quantity | Value | Units | Method | Reference | Comment |
ΔrS° | 18.2 | cal/mol*K | PHPMS | Sieck, 1985 | gas phase; M |
ΔrS° | 19.6 | cal/mol*K | PHPMS | French, Ikuta, et al., 1982 | gas phase; M |
ΔrS° | 17.1 | cal/mol*K | PHPMS | Hiraoka, Takimoto, et al., 1986 | gas phase; M |
ΔrS° | 19.7 | cal/mol*K | N/A | Larson and McMahon, 1984 | gas phase; switching reaction(Cl-)t-C4H9OH, Entropy change calculated or estimated; French, Ikuta, et al., 1982; M |
Quantity | Value | Units | Method | Reference | Comment |
ΔrG° | 8.08 ± 0.20 | kcal/mol | TDAs | Bofdanov and McMahon, 2002 | gas phase; B |
ΔrG° | 7.30 | kcal/mol | TDAs | Hiraoka, Morise, et al., 1986 | gas phase; B |
ΔrG° | 8.80 ± 0.30 | kcal/mol | TDAs | Sieck, 1985 | gas phase; B |
ΔrG° | 8.2 ± 2.0 | kcal/mol | IMRE | Larson and McMahon, 1984, 2 | gas phase; B,M |
ΔrG° | 7.9 ± 2.0 | kcal/mol | TDAs | French, Ikuta, et al., 1982 | gas phase; B |
By formula: (Cl- • C3H6O) + C3H6O = (Cl- • 2C3H6O)
Quantity | Value | Units | Method | Reference | Comment |
---|---|---|---|---|---|
ΔrH° | 11.5 ± 1.0 | kcal/mol | TDAs | Hiraoka, Takimoto, et al., 1986 | gas phase; B,M |
Quantity | Value | Units | Method | Reference | Comment |
ΔrS° | 20.3 | cal/mol*K | PHPMS | Hiraoka, Takimoto, et al., 1986 | gas phase; M |
Quantity | Value | Units | Method | Reference | Comment |
ΔrG° | 5.4 ± 2.2 | kcal/mol | TDAs | Hiraoka, Takimoto, et al., 1986 | gas phase; B |
By formula: (Cl- • 2C3H6O) + C3H6O = (Cl- • 3C3H6O)
Quantity | Value | Units | Method | Reference | Comment |
---|---|---|---|---|---|
ΔrH° | 10.4 ± 2.0 | kcal/mol | TDAs | Hiraoka, Takimoto, et al., 1986 | gas phase; Entropy estimated; B,M |
Quantity | Value | Units | Method | Reference | Comment |
ΔrS° | 22. | cal/mol*K | N/A | Hiraoka, Takimoto, et al., 1986 | gas phase; Entropy change calculated or estimated; M |
Quantity | Value | Units | Method | Reference | Comment |
ΔrG° | 3.8 ± 4.5 | kcal/mol | TDAs | Hiraoka, Takimoto, et al., 1986 | gas phase; Entropy estimated; B |
By formula: Cl- + C3H7Br = (Cl- • C3H7Br)
Quantity | Value | Units | Method | Reference | Comment |
---|---|---|---|---|---|
ΔrH° | 15.2 ± 1.0 | kcal/mol | TDAs | Li, Ross, et al., 1996 | gas phase; B |
Quantity | Value | Units | Method | Reference | Comment |
ΔrG° | 8.52 ± 0.20 | kcal/mol | TDAs | Li, Ross, et al., 1996 | gas phase; B |
By formula: Cl- + C3H7Br = (Cl- • C3H7Br)
Quantity | Value | Units | Method | Reference | Comment |
---|---|---|---|---|---|
ΔrH° | 14.2 ± 1.0 | kcal/mol | TDAs | Li, Ross, et al., 1996 | gas phase; B |
Quantity | Value | Units | Method | Reference | Comment |
ΔrG° | 8.24 ± 0.20 | kcal/mol | TDAs | Li, Ross, et al., 1996 | gas phase; B |
By formula: Cl- + C3H7Cl = (Cl- • C3H7Cl)
Quantity | Value | Units | Method | Reference | Comment |
---|---|---|---|---|---|
ΔrH° | 14.7 ± 1.0 | kcal/mol | TDAs | Li, Ross, et al., 1996 | gas phase; B |
Quantity | Value | Units | Method | Reference | Comment |
ΔrG° | 7.80 ± 0.20 | kcal/mol | TDAs | Li, Ross, et al., 1996 | gas phase; B |
By formula: Cl- + C3H8O = (Cl- • C3H8O)
Quantity | Value | Units | Method | Reference | Comment |
---|---|---|---|---|---|
ΔrH° | 19.40 ± 0.20 | kcal/mol | TDAs | Bogdanov, Peschke, et al., 1999 | gas phase; B |
ΔrH° | 18.3 ± 1.0 | kcal/mol | TDAs | Hiraoka and Mizuse, 1987 | gas phase; B,M |
ΔrH° | 17.6 ± 2.0 | kcal/mol | IMRE | Larson and McMahon, 1984, 2 | gas phase; B,M |
Quantity | Value | Units | Method | Reference | Comment |
ΔrS° | 24.7 | cal/mol*K | PHPMS | Hiraoka and Mizuse, 1987 | gas phase; M |
ΔrS° | 23.2 | cal/mol*K | N/A | Larson and McMahon, 1984, 2 | gas phase; switching reaction(cl-)t-C4H9OH, Entropy change calculated or estimated; Larson and McMahon, 1984; M |
Quantity | Value | Units | Method | Reference | Comment |
ΔrG° | 11.32 | kcal/mol | TDAs | Bogdanov, Peschke, et al., 1999 | gas phase; B |
ΔrG° | 10.90 | kcal/mol | TDAs | Hiraoka and Mizuse, 1987 | gas phase; B |
ΔrG° | 10.7 ± 2.0 | kcal/mol | IMRE | Larson and McMahon, 1984, 2 | gas phase; B,M |
By formula: (Cl- • C3H8O) + C3H8O = (Cl- • 2C3H8O)
Quantity | Value | Units | Method | Reference | Comment |
---|---|---|---|---|---|
ΔrH° | 16.70 ± 0.30 | kcal/mol | TDAs | Bogdanov, Peschke, et al., 1999 | gas phase; B |
ΔrH° | 15.6 ± 1.0 | kcal/mol | TDAs | Hiraoka and Mizuse, 1987 | gas phase; B,M |
Quantity | Value | Units | Method | Reference | Comment |
ΔrS° | 25.0 | cal/mol*K | PHPMS | Hiraoka and Mizuse, 1987 | gas phase; M |
Quantity | Value | Units | Method | Reference | Comment |
ΔrG° | 7.67 | kcal/mol | TDAs | Bogdanov, Peschke, et al., 1999 | gas phase; B |
ΔrG° | 8.1 ± 1.0 | kcal/mol | TDAs | Hiraoka and Mizuse, 1987 | gas phase; B |
By formula: (Cl- • 2C3H8O) + C3H8O = (Cl- • 3C3H8O)
Quantity | Value | Units | Method | Reference | Comment |
---|---|---|---|---|---|
ΔrH° | 14.90 ± 0.50 | kcal/mol | TDAs | Bogdanov, Peschke, et al., 1999 | gas phase; B |
ΔrH° | 12.5 ± 1.0 | kcal/mol | TDAs | Hiraoka and Mizuse, 1987 | gas phase; B,M |
Quantity | Value | Units | Method | Reference | Comment |
ΔrS° | 26.1 | cal/mol*K | PHPMS | Hiraoka and Mizuse, 1987 | gas phase; M |
Quantity | Value | Units | Method | Reference | Comment |
ΔrG° | 5.30 | kcal/mol | TDAs | Bogdanov, Peschke, et al., 1999 | gas phase; B |
ΔrG° | 4.7 ± 1.0 | kcal/mol | TDAs | Hiraoka and Mizuse, 1987 | gas phase; B |
By formula: (Cl- • 3C3H8O) + C3H8O = (Cl- • 4C3H8O)
Quantity | Value | Units | Method | Reference | Comment |
---|---|---|---|---|---|
ΔrH° | 11.9 ± 1.0 | kcal/mol | TDAs | Hiraoka and Mizuse, 1987 | gas phase; B,M |
Quantity | Value | Units | Method | Reference | Comment |
ΔrS° | 28.7 | cal/mol*K | PHPMS | Hiraoka and Mizuse, 1987 | gas phase; M |
Quantity | Value | Units | Method | Reference | Comment |
ΔrG° | 3.3 ± 1.0 | kcal/mol | TDAs | Hiraoka and Mizuse, 1987 | gas phase; B |
By formula: (Cl- • 4C3H8O) + C3H8O = (Cl- • 5C3H8O)
Quantity | Value | Units | Method | Reference | Comment |
---|---|---|---|---|---|
ΔrH° | 11.6 ± 1.0 | kcal/mol | TDAs | Hiraoka and Mizuse, 1987 | gas phase; B,M |
Quantity | Value | Units | Method | Reference | Comment |
ΔrS° | 30.5 | cal/mol*K | PHPMS | Hiraoka and Mizuse, 1987 | gas phase; M |
Quantity | Value | Units | Method | Reference | Comment |
ΔrG° | 2.4 ± 1.0 | kcal/mol | TDAs | Hiraoka and Mizuse, 1987 | gas phase; B |
By formula: (Cl- • 5C3H8O) + C3H8O = (Cl- • 6C3H8O)
Quantity | Value | Units | Method | Reference | Comment |
---|---|---|---|---|---|
ΔrH° | 11.3 ± 1.0 | kcal/mol | TDAs | Hiraoka and Mizuse, 1987 | gas phase; B,M |
Quantity | Value | Units | Method | Reference | Comment |
ΔrS° | 31.1 | cal/mol*K | PHPMS | Hiraoka and Mizuse, 1987 | gas phase; M |
Quantity | Value | Units | Method | Reference | Comment |
ΔrG° | 2.0 ± 1.0 | kcal/mol | TDAs | Hiraoka and Mizuse, 1987 | gas phase; B |
By formula: (Cl- • 6C3H8O) + C3H8O = (Cl- • 7C3H8O)
Quantity | Value | Units | Method | Reference | Comment |
---|---|---|---|---|---|
ΔrH° | 11.1 ± 1.0 | kcal/mol | TDAs | Hiraoka and Mizuse, 1987 | gas phase; B,M |
Quantity | Value | Units | Method | Reference | Comment |
ΔrS° | 31.3 | cal/mol*K | PHPMS | Hiraoka and Mizuse, 1987 | gas phase; M |
Quantity | Value | Units | Method | Reference | Comment |
ΔrG° | 1.7 ± 1.0 | kcal/mol | TDAs | Hiraoka and Mizuse, 1987 | gas phase; B |
By formula: (Cl- • 7C3H8O) + C3H8O = (Cl- • 8C3H8O)
Quantity | Value | Units | Method | Reference | Comment |
---|---|---|---|---|---|
ΔrH° | 10.9 ± 1.0 | kcal/mol | TDAs | Hiraoka and Mizuse, 1987 | gas phase; Estimated entropy; single temperature measurement; B,M |
Quantity | Value | Units | Method | Reference | Comment |
ΔrS° | 31. | cal/mol*K | N/A | Hiraoka and Mizuse, 1987 | gas phase; Entropy change calculated or estimated; M |
Quantity | Value | Units | Method | Reference | Comment |
ΔrG° | 1.6 ± 1.0 | kcal/mol | TDAs | Hiraoka and Mizuse, 1987 | gas phase; Estimated entropy; single temperature measurement; B |
By formula: Cl- + C3H8O = (Cl- • C3H8O)
Quantity | Value | Units | Method | Reference | Comment |
---|---|---|---|---|---|
ΔrH° | 20.40 ± 0.50 | kcal/mol | TDAs | Hiraoka, 1987 | gas phase; B,B,M |
ΔrH° | 17.7 ± 2.0 | kcal/mol | IMRE | Larson and McMahon, 1984, 2 | gas phase; B,M |
Quantity | Value | Units | Method | Reference | Comment |
ΔrS° | 29.0 | cal/mol*K | PHPMS | Hiraoka and Mizuse, 1987 | gas phase; M |
ΔrS° | 23.2 | cal/mol*K | N/A | Larson and McMahon, 1984, 2 | gas phase; switching reaction(Cl-)t-C4H9OH, Entropy change calculated or estimated; Larson and McMahon, 1984; M |
Quantity | Value | Units | Method | Reference | Comment |
ΔrG° | 11.70 | kcal/mol | TDAs | Hiraoka and Mizuse, 1987 | gas phase; B |
ΔrG° | 11.7 ± 2.0 | kcal/mol | TDAs | Hiraoka, 1987 | gas phase; B |
ΔrG° | 10.8 ± 2.0 | kcal/mol | IMRE | Larson and McMahon, 1984, 2 | gas phase; B,M |
By formula: (Cl- • C3H8O) + C3H8O = (Cl- • 2C3H8O)
Quantity | Value | Units | Method | Reference | Comment |
---|---|---|---|---|---|
ΔrH° | 15.8 ± 1.0 | kcal/mol | TDAs | Hiraoka and Mizuse, 1987 | gas phase; B,M |
Quantity | Value | Units | Method | Reference | Comment |
ΔrS° | 25.4 | cal/mol*K | PHPMS | Hiraoka and Mizuse, 1987 | gas phase; M |
Quantity | Value | Units | Method | Reference | Comment |
ΔrG° | 8.2 ± 1.0 | kcal/mol | TDAs | Hiraoka and Mizuse, 1987 | gas phase; B |
By formula: (Cl- • 2C3H8O) + C3H8O = (Cl- • 3C3H8O)
Quantity | Value | Units | Method | Reference | Comment |
---|---|---|---|---|---|
ΔrH° | 14.2 ± 1.0 | kcal/mol | TDAs | Hiraoka and Mizuse, 1987 | gas phase; B,M |
Quantity | Value | Units | Method | Reference | Comment |
ΔrS° | 31.2 | cal/mol*K | PHPMS | Hiraoka and Mizuse, 1987 | gas phase; M |
Quantity | Value | Units | Method | Reference | Comment |
ΔrG° | 4.8 ± 1.0 | kcal/mol | TDAs | Hiraoka and Mizuse, 1987 | gas phase; B |
By formula: (Cl- • 3C3H8O) + C3H8O = (Cl- • 4C3H8O)
Quantity | Value | Units | Method | Reference | Comment |
---|---|---|---|---|---|
ΔrH° | 13.3 ± 1.0 | kcal/mol | TDAs | Hiraoka and Mizuse, 1987 | gas phase; B,M |
Quantity | Value | Units | Method | Reference | Comment |
ΔrS° | 32.1 | cal/mol*K | PHPMS | Hiraoka and Mizuse, 1987 | gas phase; M |
Quantity | Value | Units | Method | Reference | Comment |
ΔrG° | 3.7 ± 1.0 | kcal/mol | TDAs | Hiraoka and Mizuse, 1987 | gas phase; B |
By formula: (Cl- • 4C3H8O) + C3H8O = (Cl- • 5C3H8O)
Quantity | Value | Units | Method | Reference | Comment |
---|---|---|---|---|---|
ΔrH° | 12.6 ± 1.0 | kcal/mol | TDAs | Hiraoka and Mizuse, 1987 | gas phase; B,M |
Quantity | Value | Units | Method | Reference | Comment |
ΔrS° | 32.9 | cal/mol*K | PHPMS | Hiraoka and Mizuse, 1987 | gas phase; M |
Quantity | Value | Units | Method | Reference | Comment |
ΔrG° | 2.7 ± 1.0 | kcal/mol | TDAs | Hiraoka and Mizuse, 1987 | gas phase; B |
By formula: (Cl- • 5C3H8O) + C3H8O = (Cl- • 6C3H8O)
Quantity | Value | Units | Method | Reference | Comment |
---|---|---|---|---|---|
ΔrH° | 11.6 ± 1.0 | kcal/mol | TDAs | Hiraoka and Mizuse, 1987 | gas phase; B,M |
Quantity | Value | Units | Method | Reference | Comment |
ΔrS° | 31.0 | cal/mol*K | PHPMS | Hiraoka and Mizuse, 1987 | gas phase; M |
Quantity | Value | Units | Method | Reference | Comment |
ΔrG° | 2.3 ± 1.0 | kcal/mol | TDAs | Hiraoka and Mizuse, 1987 | gas phase; B |
By formula: (Cl- • 6C3H8O) + C3H8O = (Cl- • 7C3H8O)
Quantity | Value | Units | Method | Reference | Comment |
---|---|---|---|---|---|
ΔrH° | 11.0 ± 1.0 | kcal/mol | TDAs | Hiraoka and Mizuse, 1987 | gas phase; B,M |
Quantity | Value | Units | Method | Reference | Comment |
ΔrS° | 30.2 | cal/mol*K | PHPMS | Hiraoka and Mizuse, 1987 | gas phase; M |
Quantity | Value | Units | Method | Reference | Comment |
ΔrG° | 1.9 ± 1.0 | kcal/mol | TDAs | Hiraoka and Mizuse, 1987 | gas phase; B |
By formula: (Cl- • 7C3H8O) + C3H8O = (Cl- • 8C3H8O)
Quantity | Value | Units | Method | Reference | Comment |
---|---|---|---|---|---|
ΔrH° | 10.8 ± 1.0 | kcal/mol | TDAs | Hiraoka and Mizuse, 1987 | gas phase; Estimated entropy; single temperature measurement; B,M |
Quantity | Value | Units | Method | Reference | Comment |
ΔrS° | 30. | cal/mol*K | N/A | Hiraoka and Mizuse, 1987 | gas phase; Entropy change calculated or estimated; M |
Quantity | Value | Units | Method | Reference | Comment |
ΔrG° | 1.8 ± 1.0 | kcal/mol | TDAs | Hiraoka and Mizuse, 1987 | gas phase; Estimated entropy; single temperature measurement; B |
+ C3H9ClGe = C3H9Cl2Ge-
By formula: Cl- + C3H9ClGe = C3H9Cl2Ge-
Quantity | Value | Units | Method | Reference | Comment |
---|---|---|---|---|---|
ΔrH° | 22.2 ± 1.4 | kcal/mol | CIDT | Hao, Kaspar, et al., 2005 | gas phase; B |
+
= C3H9Cl2Si-
By formula: Cl- + C3H9ClSi = C3H9Cl2Si-
Quantity | Value | Units | Method | Reference | Comment |
---|---|---|---|---|---|
ΔrH° | 14.3 ± 1.4 | kcal/mol | CIDT | Hao, Kaspar, et al., 2005 | gas phase; B |
+
= C3H9Cl2Sn-
By formula: Cl- + C3H9ClSn = C3H9Cl2Sn-
Quantity | Value | Units | Method | Reference | Comment |
---|---|---|---|---|---|
ΔrH° | 31.3 ± 1.7 | kcal/mol | CIDT | Hao, Kaspar, et al., 2005 | gas phase; B |
By formula: Cl- + C4H4F6O = (Cl- • C4H4F6O)
Quantity | Value | Units | Method | Reference | Comment |
---|---|---|---|---|---|
ΔrH° | 26.5 | kcal/mol | ICR | Larson and McMahon, 1984, 2 | gas phase; switching reaction(Cl-)HCOOH, Entropy change calculated or estimated, DG>, ΔrH>; Larson and McMahon, 1984; M |
Quantity | Value | Units | Method | Reference | Comment |
ΔrS° | 25.0 | cal/mol*K | N/A | Larson and McMahon, 1984, 2 | gas phase; switching reaction(Cl-)HCOOH, Entropy change calculated or estimated, DG>, ΔrH>; Larson and McMahon, 1984; M |
Quantity | Value | Units | Method | Reference | Comment |
ΔrG° | 19.0 | kcal/mol | ICR | Larson and McMahon, 1984, 2 | gas phase; switching reaction(Cl-)HCOOH, Entropy change calculated or estimated, DG>, ΔrH>; Larson and McMahon, 1984; M |
By formula: Cl- + C4H5N = (Cl- • C4H5N)
Quantity | Value | Units | Method | Reference | Comment |
---|---|---|---|---|---|
ΔrH° | 18.8 ± 2.0 | kcal/mol | IMRE | Larson and McMahon, 1984, 2 | gas phase; B |
Quantity | Value | Units | Method | Reference | Comment |
ΔrG° | 11.8 ± 2.0 | kcal/mol | IMRE | Larson and McMahon, 1984, 2 | gas phase; B |
ΔrG° | 14.00 | kcal/mol | TDEq | French, Ikuta, et al., 1982 | gas phase; B |
Free energy of reaction
ΔrG° (kcal/mol) | T (K) | Method | Reference | Comment |
---|---|---|---|---|
11.6 | 421. | PHPMS | French, Ikuta, et al., 1982 | gas phase; M |
By formula: Cl- + C4H6O2 = (Cl- • C4H6O2)
Quantity | Value | Units | Method | Reference | Comment |
---|---|---|---|---|---|
ΔrH° | 28.9 ± 1.1 | kcal/mol | TDAs | Zhang, Beglinger, et al., 1995 | gas phase; B |
Quantity | Value | Units | Method | Reference | Comment |
ΔrG° | 18.0 ± 1.0 | kcal/mol | TDAs | Zhang, Beglinger, et al., 1995 | gas phase; B |
By formula: (Cl- • C4H6O2) + C4H6O2 = (Cl- • 2C4H6O2)
Quantity | Value | Units | Method | Reference | Comment |
---|---|---|---|---|---|
ΔrH° | 22.30 ± 0.70 | kcal/mol | TDAs | Zhang, Beglinger, et al., 1995 | gas phase; B |
Quantity | Value | Units | Method | Reference | Comment |
ΔrG° | 11.9 ± 1.0 | kcal/mol | TDAs | Zhang, Beglinger, et al., 1995 | gas phase; B |
By formula: Cl- + C4H8O = (Cl- • C4H8O)
Quantity | Value | Units | Method | Reference | Comment |
---|---|---|---|---|---|
ΔrH° | 14.8 ± 2.0 | kcal/mol | IMRE | Larson and McMahon, 1984, 2 | gas phase; B,M |
Quantity | Value | Units | Method | Reference | Comment |
ΔrS° | 21.0 | cal/mol*K | N/A | Larson and McMahon, 1984, 2 | gas phase; switching reaction(Cl-)(CH3)2CO, Entropy change calculated or estimated; Larson and McMahon, 1984; M |
Quantity | Value | Units | Method | Reference | Comment |
ΔrG° | 8.5 ± 2.0 | kcal/mol | IMRE | Larson and McMahon, 1984, 2 | gas phase; B,M |
By formula: Cl- + C4H8O2 = (Cl- • C4H8O2)
Quantity | Value | Units | Method | Reference | Comment |
---|---|---|---|---|---|
ΔrH° | 32.9 ± 1.5 | kcal/mol | TDAs | Zhang, Beglinger, et al., 1995 | gas phase; B |
Quantity | Value | Units | Method | Reference | Comment |
ΔrG° | 19.7 ± 1.0 | kcal/mol | TDAs | Zhang, Beglinger, et al., 1995 | gas phase; B |
By formula: (Cl- • C4H8O2) + C4H8O2 = (Cl- • 2C4H8O2)
Quantity | Value | Units | Method | Reference | Comment |
---|---|---|---|---|---|
ΔrH° | 22.90 ± 0.40 | kcal/mol | TDAs | Zhang, Beglinger, et al., 1995 | gas phase; B |
Quantity | Value | Units | Method | Reference | Comment |
ΔrG° | 11.7 ± 1.0 | kcal/mol | TDAs | Zhang, Beglinger, et al., 1995 | gas phase; B |
By formula: Cl- + C4H9Br = (Cl- • C4H9Br)
Quantity | Value | Units | Method | Reference | Comment |
---|---|---|---|---|---|
ΔrH° | 17.7 ± 1.0 | kcal/mol | TDAs | Li, Ross, et al., 1996 | gas phase; B |
Quantity | Value | Units | Method | Reference | Comment |
ΔrG° | 8.90 ± 0.20 | kcal/mol | TDAs | Li, Ross, et al., 1996 | gas phase; B |
By formula: Cl- + C4H9Cl = (Cl- • C4H9Cl)
Quantity | Value | Units | Method | Reference | Comment |
---|---|---|---|---|---|
ΔrH° | 16.6 ± 1.0 | kcal/mol | TDAs | Li, Ross, et al., 1996 | gas phase; B |
ΔrH° | 14.3 ± 2.0 | kcal/mol | IMRE | Larson and McMahon, 1984, 2 | gas phase; B,M |
Quantity | Value | Units | Method | Reference | Comment |
ΔrS° | 21.2 | cal/mol*K | N/A | Larson and McMahon, 1984, 2 | gas phase; switching reaction(Cl-)t-C4H9F, Entropy change calculated or estimated; Larson and McMahon, 1984; M |
Quantity | Value | Units | Method | Reference | Comment |
ΔrG° | 8.30 ± 0.20 | kcal/mol | TDAs | Li, Ross, et al., 1996 | gas phase; B |
ΔrG° | 8.0 ± 2.0 | kcal/mol | IMRE | Larson and McMahon, 1984, 2 | gas phase; B,M |
By formula: Cl- + C4H9F = (Cl- • C4H9F)
Quantity | Value | Units | Method | Reference | Comment |
---|---|---|---|---|---|
ΔrH° | 13.3 ± 2.0 | kcal/mol | IMRE | Larson and McMahon, 1984, 2 | gas phase; B,M |
Quantity | Value | Units | Method | Reference | Comment |
ΔrS° | 20.8 | cal/mol*K | N/A | Larson and McMahon, 1984 | gas phase; switching reaction(Cl-)t-C4H9OH, Entropy change calculated or estimated; French, Ikuta, et al., 1982; M |
Quantity | Value | Units | Method | Reference | Comment |
ΔrG° | 7.1 ± 2.0 | kcal/mol | IMRE | Larson and McMahon, 1984, 2 | gas phase; B,M |
+
= C4H10ClO-
By formula: Cl- + C4H10O = C4H10ClO-
Quantity | Value | Units | Method | Reference | Comment |
---|---|---|---|---|---|
ΔrH° | 9.00 ± 0.40 | kcal/mol | TDAs | Bogdanov, Lee, et al., 2001 | gas phase; B |
Quantity | Value | Units | Method | Reference | Comment |
ΔrG° | 3.3 ± 1.0 | kcal/mol | TDAs | Bogdanov, Lee, et al., 2001 | gas phase; B |
By formula: Cl- + C4H10O = (Cl- • C4H10O)
Quantity | Value | Units | Method | Reference | Comment |
---|---|---|---|---|---|
ΔrH° | 17.6 ± 2.0 | kcal/mol | IMRE | Larson and McMahon, 1984, 2 | gas phase; B,M |
Quantity | Value | Units | Method | Reference | Comment |
ΔrS° | 23.2 | cal/mol*K | N/A | Larson and McMahon, 1984, 2 | gas phase; switching reaction(Cl-)CH3OH, Entropy change calculated or estimated; Larson and McMahon, 1984; M |
Quantity | Value | Units | Method | Reference | Comment |
ΔrG° | 10.7 ± 2.0 | kcal/mol | IMRE | Larson and McMahon, 1984, 2 | gas phase; B,M |
By formula: Cl- + C4H10O = (Cl- • C4H10O)
Quantity | Value | Units | Method | Reference | Comment |
---|---|---|---|---|---|
ΔrH° | 19. ± 4. | kcal/mol | AVG | N/A | Average of 6 values; Individual data points |
Quantity | Value | Units | Method | Reference | Comment |
ΔrS° | 27.4 | cal/mol*K | PHPMS | Hiraoka and Mizuse, 1987 | gas phase; M |
ΔrS° | 24.0 | cal/mol*K | PHPMS | Sieck, 1985 | gas phase; M |
ΔrS° | 23.4 | cal/mol*K | N/A | Larson and McMahon, 1984 | gas phase; Entropy change calculated or estimated; French, Ikuta, et al., 1982; M |
ΔrS° | 27. | cal/mol*K | PHPMS | Kebarle, 1977 | gas phase; M |
ΔrS° | 10.3 | cal/mol*K | N/A | Yamdagni and Kebarle, 1971 | gas phase; Entropy change calculated or estimated; M |
Quantity | Value | Units | Method | Reference | Comment |
ΔrG° | 11.58 | kcal/mol | TDAs | Bogdanov, Peschke, et al., 1999 | gas phase; B |
ΔrG° | 12.30 ± 0.30 | kcal/mol | TDAs | Sieck, 1985 | gas phase; B |
ΔrG° | 11.60 | kcal/mol | TDAs | Hiraoka and Mizuse, 1987 | gas phase; B |
ΔrG° | 11.1 ± 2.0 | kcal/mol | IMRE | Larson and McMahon, 1984, 2 | gas phase; B,M |
ΔrG° | 11.1 ± 2.0 | kcal/mol | TDAs | Yamdagni and Kebarle, 1971 | gas phase; B |
By formula: (Cl- • C4H10O) + C4H10O = (Cl- • 2C4H10O)
Quantity | Value | Units | Method | Reference | Comment |
---|---|---|---|---|---|
ΔrH° | 16.90 ± 0.20 | kcal/mol | TDAs | Bogdanov, Peschke, et al., 1999 | gas phase; B |
ΔrH° | 14.9 ± 1.0 | kcal/mol | TDAs | Hiraoka and Mizuse, 1987 | gas phase; B,M |
Quantity | Value | Units | Method | Reference | Comment |
ΔrS° | 25.8 | cal/mol*K | PHPMS | Hiraoka and Mizuse, 1987 | gas phase; M |
Quantity | Value | Units | Method | Reference | Comment |
ΔrG° | 7.36 | kcal/mol | TDAs | Bogdanov, Peschke, et al., 1999 | gas phase; B |
ΔrG° | 7.2 ± 1.0 | kcal/mol | TDAs | Hiraoka and Mizuse, 1987 | gas phase; B |
By formula: (Cl- • 2C4H10O) + C4H10O = (Cl- • 3C4H10O)
Quantity | Value | Units | Method | Reference | Comment |
---|---|---|---|---|---|
ΔrH° | 15.80 ± 0.30 | kcal/mol | TDAs | Bogdanov, Peschke, et al., 1999 | gas phase; B |
ΔrH° | 13.7 ± 1.0 | kcal/mol | TDAs | Hiraoka and Mizuse, 1987 | gas phase; B,M |
Quantity | Value | Units | Method | Reference | Comment |
ΔrS° | 31.0 | cal/mol*K | PHPMS | Hiraoka and Mizuse, 1987 | gas phase; M |
Quantity | Value | Units | Method | Reference | Comment |
ΔrG° | 5.07 | kcal/mol | TDAs | Bogdanov, Peschke, et al., 1999 | gas phase; B |
ΔrG° | 4.4 ± 1.0 | kcal/mol | TDAs | Hiraoka and Mizuse, 1987 | gas phase; B |
By formula: (Cl- • 3C4H10O) + C4H10O = (Cl- • 4C4H10O)
Quantity | Value | Units | Method | Reference | Comment |
---|---|---|---|---|---|
ΔrH° | 12.7 ± 1.0 | kcal/mol | TDAs | Hiraoka and Mizuse, 1987 | gas phase; B,M |
Quantity | Value | Units | Method | Reference | Comment |
ΔrS° | 31.3 | cal/mol*K | PHPMS | Hiraoka and Mizuse, 1987 | gas phase; M |
Quantity | Value | Units | Method | Reference | Comment |
ΔrG° | 3.3 ± 1.0 | kcal/mol | TDAs | Hiraoka and Mizuse, 1987 | gas phase; B |
By formula: (Cl- • 4C4H10O) + C4H10O = (Cl- • 5C4H10O)
Quantity | Value | Units | Method | Reference | Comment |
---|---|---|---|---|---|
ΔrH° | 11.9 ± 1.0 | kcal/mol | TDAs | Hiraoka and Mizuse, 1987 | gas phase; B,M |
Quantity | Value | Units | Method | Reference | Comment |
ΔrS° | 32.3 | cal/mol*K | PHPMS | Hiraoka and Mizuse, 1987 | gas phase; M |
Quantity | Value | Units | Method | Reference | Comment |
ΔrG° | 2.2 ± 1.0 | kcal/mol | TDAs | Hiraoka and Mizuse, 1987 | gas phase; B |
By formula: (Cl- • 5C4H10O) + C4H10O = (Cl- • 6C4H10O)
Quantity | Value | Units | Method | Reference | Comment |
---|---|---|---|---|---|
ΔrH° | 11.4 ± 1.0 | kcal/mol | TDAs | Hiraoka and Mizuse, 1987 | gas phase; Estimated entropy; single temperature measurement; B,M |
Quantity | Value | Units | Method | Reference | Comment |
ΔrS° | 32. | cal/mol*K | N/A | Hiraoka and Mizuse, 1987 | gas phase; Entropy change calculated or estimated; M |
Quantity | Value | Units | Method | Reference | Comment |
ΔrG° | 1.8 ± 1.0 | kcal/mol | TDAs | Hiraoka and Mizuse, 1987 | gas phase; Estimated entropy; single temperature measurement; B |
By formula: Cl- + C4H10O2 = (Cl- • C4H10O2)
Quantity | Value | Units | Method | Reference | Comment |
---|---|---|---|---|---|
ΔrH° | 30.2 ± 1.7 | kcal/mol | TDAs | Zhang, Beglinger, et al., 1995 | gas phase; B |
Quantity | Value | Units | Method | Reference | Comment |
ΔrG° | 17.5 ± 1.0 | kcal/mol | TDAs | Zhang, Beglinger, et al., 1995 | gas phase; B |
By formula: (Cl- • C4H10O2) + C4H10O2 = (Cl- • 2C4H10O2)
Quantity | Value | Units | Method | Reference | Comment |
---|---|---|---|---|---|
ΔrH° | 21.20 ± 0.80 | kcal/mol | TDAs | Zhang, Beglinger, et al., 1995 | gas phase; B |
Quantity | Value | Units | Method | Reference | Comment |
ΔrG° | 10.6 ± 1.0 | kcal/mol | TDAs | Zhang, Beglinger, et al., 1995 | gas phase; B |
+
= C5ClF8-
By formula: Cl- + C5F8 = C5ClF8-
Quantity | Value | Units | Method | Reference | Comment |
---|---|---|---|---|---|
ΔrH° | 13.80 ± 0.20 | kcal/mol | TDAs | Hiraoka, Fujita, et al., 1905 | gas phase; B |
Quantity | Value | Units | Method | Reference | Comment |
ΔrG° | 8.14 ± 0.20 | kcal/mol | TDAs | Hiraoka, Fujita, et al., 1905 | gas phase; B |
By formula: Cl- + C5FeO5 = (Cl- • C5FeO5)
Quantity | Value | Units | Method | Reference | Comment |
---|---|---|---|---|---|
ΔrH° | 13.9 ± 3.0 | kcal/mol | IMRB | Lane, Sallans, et al., 1985 | gas phase; B |
Quantity | Value | Units | Method | Reference | Comment |
ΔrG° | 7.9 ± 3.0 | kcal/mol | IMRB | Lane, Sallans, et al., 1985 | gas phase; B |
By formula: Cl- + C5H5N = (Cl- • C5H5N)
Quantity | Value | Units | Method | Reference | Comment |
---|---|---|---|---|---|
ΔrH° | 12.7 ± 2.0 | kcal/mol | TDAs | Hiraoka, Mizuse, et al., 1988 | gas phase; B,M |
Quantity | Value | Units | Method | Reference | Comment |
ΔrS° | 19.7 | cal/mol*K | PHPMS | Hiraoka, Mizuse, et al., 1988 | gas phase; M |
Quantity | Value | Units | Method | Reference | Comment |
ΔrG° | 6.8 ± 2.6 | kcal/mol | TDAs | Hiraoka, Mizuse, et al., 1988 | gas phase; B |
By formula: (Cl- • C5H5N) + C5H5N = (Cl- • 2C5H5N)
Quantity | Value | Units | Method | Reference | Comment |
---|---|---|---|---|---|
ΔrH° | 11.7 | kcal/mol | PHPMS | Hiraoka, Mizuse, et al., 1988 | gas phase; M |
Quantity | Value | Units | Method | Reference | Comment |
ΔrS° | 22.6 | cal/mol*K | PHPMS | Hiraoka, Mizuse, et al., 1988 | gas phase; M |
By formula: Cl- + C5H6 = (Cl- • C5H6)
Quantity | Value | Units | Method | Reference | Comment |
---|---|---|---|---|---|
ΔrG° | <2.50 | kcal/mol | TDEq | French, Ikuta, et al., 1982 | gas phase; B |
Free energy of reaction
ΔrG° (kcal/mol) | T (K) | Method | Reference | Comment |
---|---|---|---|---|
2.5 | 300. | PHPMS | French, Ikuta, et al., 1982 | gas phase; DG<; M |
By formula: Cl- + C5H8O2 = (Cl- • C5H8O2)
Quantity | Value | Units | Method | Reference | Comment |
---|---|---|---|---|---|
ΔrG° | 13.40 | kcal/mol | TDEq | French, Ikuta, et al., 1982 | gas phase; B |
Free energy of reaction
ΔrG° (kcal/mol) | T (K) | Method | Reference | Comment |
---|---|---|---|---|
11.0 | 421. | PHPMS | French, Ikuta, et al., 1982 | gas phase; M |
By formula: Cl- + C5H8 = (Cl- • C5H8)
Free energy of reaction
ΔrG° (kcal/mol) | T (K) | Method | Reference | Comment |
---|---|---|---|---|
3.7 | 300. | PHPMS | French, Ikuta, et al., 1982 | gas phase; M |
By formula: Cl- + C5H8 = (Cl- • C5H8)
Quantity | Value | Units | Method | Reference | Comment |
---|---|---|---|---|---|
ΔrG° | 3.70 | kcal/mol | TDEq | French, Ikuta, et al., 1982 | gas phase; B |
By formula: Cl- + C5H9N = (Cl- • C5H9N)
Quantity | Value | Units | Method | Reference | Comment |
---|---|---|---|---|---|
ΔrH° | 18.5 ± 1.0 | kcal/mol | TDAs | Li, Ross, et al., 1996 | gas phase; B |
Quantity | Value | Units | Method | Reference | Comment |
ΔrG° | 11.05 ± 0.20 | kcal/mol | TDAs | Li, Ross, et al., 1996 | gas phase; B |
By formula: Cl- + C5H10O = (Cl- • C5H10O)
Quantity | Value | Units | Method | Reference | Comment |
---|---|---|---|---|---|
ΔrH° | 14.1 ± 2.0 | kcal/mol | IMRE | Larson and McMahon, 1984, 2 | gas phase; B,M |
Quantity | Value | Units | Method | Reference | Comment |
ΔrS° | 19.6 | cal/mol*K | N/A | Larson and McMahon, 1984, 2 | gas phase; switching reaction(Cl-)(CH3)2CO, Entropy change calculated or estimated; Larson and McMahon, 1984; M |
Quantity | Value | Units | Method | Reference | Comment |
ΔrG° | 8.2 ± 2.0 | kcal/mol | IMRE | Larson and McMahon, 1984, 2 | gas phase; B,M |
By formula: Cl- + C5H10O = (Cl- • C5H10O)
Quantity | Value | Units | Method | Reference | Comment |
---|---|---|---|---|---|
ΔrH° | 15.0 ± 2.0 | kcal/mol | IMRE | Larson and McMahon, 1984, 2 | gas phase; B,M |
Quantity | Value | Units | Method | Reference | Comment |
ΔrS° | 21.9 | cal/mol*K | N/A | Larson and McMahon, 1984, 2 | gas phase; switching reaction(Cl-)CF3H, Entropy change calculated or estimated; Larson and McMahon, 1984; M |
Quantity | Value | Units | Method | Reference | Comment |
ΔrG° | 8.4 ± 2.0 | kcal/mol | IMRE | Larson and McMahon, 1984, 2 | gas phase; B,M |
By formula: Cl- + C6F4O2 = (Cl- • C6F4O2)
Quantity | Value | Units | Method | Reference | Comment |
---|---|---|---|---|---|
ΔrH° | 27.0 ± 1.0 | kcal/mol | TDAs | Chowdhury and Kebarle, 1986 | gas phase; B,M |
Quantity | Value | Units | Method | Reference | Comment |
ΔrS° | 22.7 | cal/mol*K | PHPMS | Chowdhury and Kebarle, 1986 | gas phase; M |
Quantity | Value | Units | Method | Reference | Comment |
ΔrG° | 20.2 ± 1.6 | kcal/mol | TDAs | Chowdhury and Kebarle, 1986 | gas phase; B |
By formula: Cl- + C6F6 = (Cl- • C6F6)
Quantity | Value | Units | Method | Reference | Comment |
---|---|---|---|---|---|
ΔrH° | 16.8 ± 1.0 | kcal/mol | TDAs | Chowdhury and Kebarle, 1986 | gas phase; B,M |
ΔrH° | 15.5 ± 1.0 | kcal/mol | TDAs | Hiraoka, Mizuse, et al., 1987, 2 | gas phase; B,M |
Quantity | Value | Units | Method | Reference | Comment |
ΔrS° | 22.5 | cal/mol*K | PHPMS | Hiraoka, Mizuse, et al., 1987, 2 | gas phase; M |
ΔrS° | 26.9 | cal/mol*K | PHPMS | Chowdhury and Kebarle, 1986 | gas phase; M |
Quantity | Value | Units | Method | Reference | Comment |
ΔrG° | 8.8 ± 1.6 | kcal/mol | TDAs | Chowdhury and Kebarle, 1986 | gas phase; B |
ΔrG° | 8.7 ± 1.6 | kcal/mol | TDAs | Hiraoka, Mizuse, et al., 1987, 2 | gas phase; B |
By formula: (Cl- • C6F6) + C6F6 = (Cl- • 2C6F6)
Quantity | Value | Units | Method | Reference | Comment |
---|---|---|---|---|---|
ΔrH° | 13.8 | kcal/mol | PHPMS | Hiraoka, Mizuse, et al., 1987, 2 | gas phase; M |
Quantity | Value | Units | Method | Reference | Comment |
ΔrS° | 26.3 | cal/mol*K | PHPMS | Hiraoka, Mizuse, et al., 1987, 2 | gas phase; M |
By formula: Cl- + C6H4FNO2 = (Cl- • C6H4FNO2)
Quantity | Value | Units | Method | Reference | Comment |
---|---|---|---|---|---|
ΔrH° | 18.7 ± 1.0 | kcal/mol | TDAs | Chowdhury and Kebarle, 1986 | gas phase; B,M |
Quantity | Value | Units | Method | Reference | Comment |
ΔrS° | 21.2 | cal/mol*K | PHPMS | Chowdhury and Kebarle, 1986 | gas phase; M |
Quantity | Value | Units | Method | Reference | Comment |
ΔrG° | 12.3 ± 1.6 | kcal/mol | TDAs | Chowdhury and Kebarle, 1986 | gas phase; B |
By formula: Cl- + C6H4F2 = (Cl- • C6H4F2)
Quantity | Value | Units | Method | Reference | Comment |
---|---|---|---|---|---|
ΔrH° | 14.3 ± 2.0 | kcal/mol | IMRE | Larson and McMahon, 1984, 2 | gas phase; B,M |
Quantity | Value | Units | Method | Reference | Comment |
ΔrS° | 21.6 | cal/mol*K | N/A | Larson and McMahon, 1984, 2 | gas phase; switching reaction(Cl-)ClCOOCH3, Entropy change calculated or estimated; Larson and McMahon, 1984; M |
Quantity | Value | Units | Method | Reference | Comment |
ΔrG° | 7.8 ± 2.0 | kcal/mol | IMRE | Larson and McMahon, 1984, 2 | gas phase; B,M |
By formula: Cl- + C6H4F2 = (Cl- • C6H4F2)
Quantity | Value | Units | Method | Reference | Comment |
---|---|---|---|---|---|
ΔrH° | 14.6 ± 2.0 | kcal/mol | IMRE | Larson and McMahon, 1984, 2 | gas phase; B,M |
Quantity | Value | Units | Method | Reference | Comment |
ΔrS° | 22.6 | cal/mol*K | N/A | Larson and McMahon, 1984, 2 | gas phase; switching reaction(Cl-)ClCOOCH3, Entropy change calculated or estimated; Larson and McMahon, 1984; M |
Quantity | Value | Units | Method | Reference | Comment |
ΔrG° | 7.8 ± 2.0 | kcal/mol | IMRE | Larson and McMahon, 1984, 2 | gas phase; B,M |
ΔrG° | 7.7 ± 1.0 | kcal/mol | TDEq | French, Ikuta, et al., 1982 | gas phase; B |
By formula: Cl- + C6H4F2 = (Cl- • C6H4F2)
Quantity | Value | Units | Method | Reference | Comment |
---|---|---|---|---|---|
ΔrH° | 13.8 ± 2.0 | kcal/mol | IMRE | Larson and McMahon, 1984, 2 | gas phase; B,M |
Quantity | Value | Units | Method | Reference | Comment |
ΔrS° | 21.6 | cal/mol*K | N/A | Larson and McMahon, 1984, 2 | gas phase; switching reaction(Cl-)ClCOOCH3, Entropy change calculated or estimated; Larson and McMahon, 1984; M |
Quantity | Value | Units | Method | Reference | Comment |
ΔrG° | 7.3 ± 2.0 | kcal/mol | IMRE | Larson and McMahon, 1984, 2 | gas phase; B,M |
By formula: Cl- + C6H5Br = (Cl- • C6H5Br)
Quantity | Value | Units | Method | Reference | Comment |
---|---|---|---|---|---|
ΔrG° | 6.80 | kcal/mol | TDEq | French, Ikuta, et al., 1982 | gas phase; B,M |
By formula: Cl- + C6H5ClO = (Cl- • C6H5ClO)
Quantity | Value | Units | Method | Reference | Comment |
---|---|---|---|---|---|
ΔrH° | 29.6 ± 2.0 | kcal/mol | TDEq | Cummings, French, et al., 1977 | gas phase; Re-anchored to data in French, Ikuta, et al., 1982.; B,M |
ΔrH° | 30.1 | kcal/mol | PHPMS | Paul and Kebarle, 1990 | gas phase; Entropy change calculated or estimated; M |
Quantity | Value | Units | Method | Reference | Comment |
ΔrS° | 25. | cal/mol*K | N/A | Paul and Kebarle, 1990 | gas phase; Entropy change calculated or estimated; M |
ΔrS° | 26.3 | cal/mol*K | N/A | Cummings, French, et al., 1977 | gas phase; switching reaction(Cl-)C6H5OH, Entropy change calculated or estimated; French, Ikuta, et al., 1982; M |
Quantity | Value | Units | Method | Reference | Comment |
ΔrG° | 22.1 ± 2.0 | kcal/mol | TDEq | Cummings, French, et al., 1977 | gas phase; Re-anchored to data in French, Ikuta, et al., 1982.; B |
Free energy of reaction
ΔrG° (kcal/mol) | T (K) | Method | Reference | Comment |
---|---|---|---|---|
19.5 | 423. | PHPMS | Paul and Kebarle, 1990 | gas phase; Entropy change calculated or estimated; M |
21.0 | 300. | PHPMS | Cummings, French, et al., 1977 | gas phase; switching reaction(Cl-)C6H5OH, Entropy change calculated or estimated; French, Ikuta, et al., 1982; M |
By formula: Cl- + C6H5Cl = (Cl- • C6H5Cl)
Quantity | Value | Units | Method | Reference | Comment |
---|---|---|---|---|---|
ΔrH° | 12.00 ± 0.10 | kcal/mol | TDAs | Sieck, 1985 | gas phase; B,M |
ΔrH° | 13.6 ± 1.0 | kcal/mol | IMRE | Larson and McMahon, 1984 | gas phase; B,B,M |
ΔrH° | 12.6 | kcal/mol | PHPMS | Paul and Kebarle, 1991 | gas phase; from Ph. D. thesis of S. Chowdhury, Entropy change calculated or estimated; M |
Quantity | Value | Units | Method | Reference | Comment |
ΔrS° | 20. | cal/mol*K | N/A | Paul and Kebarle, 1991 | gas phase; from Ph. D. thesis of S. Chowdhury, Entropy change calculated or estimated; M |
ΔrS° | 16.5 | cal/mol*K | PHPMS | Sieck, 1985 | gas phase; M |
ΔrS° | 22.4 | cal/mol*K | N/A | Larson and McMahon, 1984 | gas phase; switching reaction(Cl-)t-C4H9OH, Entropy change calculated or estimated; French, Ikuta, et al., 1982; M |
Quantity | Value | Units | Method | Reference | Comment |
ΔrG° | 7.10 ± 0.20 | kcal/mol | TDAs | Sieck, 1985 | gas phase; B |
ΔrG° | 6.9 ± 1.0 | kcal/mol | IMRE | Larson and McMahon, 1984 | gas phase; B,B,M |
ΔrG° | 6.50 | kcal/mol | TDEq | French, Ikuta, et al., 1982 | gas phase; B |
Free energy of reaction
ΔrG° (kcal/mol) | T (K) | Method | Reference | Comment |
---|---|---|---|---|
6.6 | 300. | PHPMS | Paul and Kebarle, 1991 | gas phase; from Ph. D. thesis of S. Chowdhury, Entropy change calculated or estimated; M |
6.5 | 300. | PHPMS | French, Ikuta, et al., 1982 | gas phase; M |
By formula: Cl- + C6H5FO = (Cl- • C6H5FO)
Quantity | Value | Units | Method | Reference | Comment |
---|---|---|---|---|---|
ΔrH° | 27.9 ± 2.0 | kcal/mol | TDEq | Cummings, French, et al., 1977 | gas phase; Re-anchored to data in French, Ikuta, et al., 1982.; B,M |
ΔrH° | 28.6 | kcal/mol | PHPMS | Paul and Kebarle, 1990 | gas phase; Entropy change calculated or estimated; M |
Quantity | Value | Units | Method | Reference | Comment |
ΔrS° | 25. | cal/mol*K | N/A | Paul and Kebarle, 1990 | gas phase; Entropy change calculated or estimated; M |
ΔrS° | 25.3 | cal/mol*K | N/A | Cummings, French, et al., 1977 | gas phase; switching reaction(Cl-)C6H5OH, Entropy change calculated or estimated; French, Ikuta, et al., 1982; M |
Quantity | Value | Units | Method | Reference | Comment |
ΔrG° | 20.6 ± 2.0 | kcal/mol | TDEq | Cummings, French, et al., 1977 | gas phase; Re-anchored to data in French, Ikuta, et al., 1982.; B |
Free energy of reaction
ΔrG° (kcal/mol) | T (K) | Method | Reference | Comment |
---|---|---|---|---|
18.0 | 423. | PHPMS | Paul and Kebarle, 1990 | gas phase; Entropy change calculated or estimated; M |
19.3 | 300. | PHPMS | Cummings, French, et al., 1977 | gas phase; switching reaction(Cl-)C6H5OH, Entropy change calculated or estimated; French, Ikuta, et al., 1982; M |
By formula: Cl- + C6H5F = (Cl- • C6H5F)
Quantity | Value | Units | Method | Reference | Comment |
---|---|---|---|---|---|
ΔrG° | 5.90 | kcal/mol | TDEq | French, Ikuta, et al., 1982 | gas phase; B |
Free energy of reaction
ΔrG° (kcal/mol) | T (K) | Method | Reference | Comment |
---|---|---|---|---|
5.9 | 300. | PHPMS | French, Ikuta, et al., 1982 | gas phase; M |
By formula: Cl- + C6H5I = (Cl- • C6H5I)
Quantity | Value | Units | Method | Reference | Comment |
---|---|---|---|---|---|
ΔrG° | 7.20 | kcal/mol | TDEq | French, Ikuta, et al., 1982 | gas phase; B |
Free energy of reaction
ΔrG° (kcal/mol) | T (K) | Method | Reference | Comment |
---|---|---|---|---|
7.2 | 300. | PHPMS | French, Ikuta, et al., 1982 | gas phase; M |
By formula: Cl- + C6H5NO2 = (Cl- • C6H5NO2)
Quantity | Value | Units | Method | Reference | Comment |
---|---|---|---|---|---|
ΔrH° | 16.3 ± 1.0 | kcal/mol | TDAs | Chowdhury and Kebarle, 1986 | gas phase; B,M |
ΔrH° | 16.5 | kcal/mol | PHPMS | Paul and Kebarle, 1991 | gas phase; from Ph. D. thesis of S. Chowdhury, Entropy change calculated or estimated; M |
Quantity | Value | Units | Method | Reference | Comment |
ΔrS° | 20. | cal/mol*K | N/A | Paul and Kebarle, 1991 | gas phase; from Ph. D. thesis of S. Chowdhury, Entropy change calculated or estimated; M |
ΔrS° | 19.4 | cal/mol*K | PHPMS | Chowdhury and Kebarle, 1986 | gas phase; M |
Quantity | Value | Units | Method | Reference | Comment |
ΔrG° | 10.5 ± 1.6 | kcal/mol | TDAs | Chowdhury and Kebarle, 1986 | gas phase; B |
ΔrG° | 7.10 | kcal/mol | TDEq | French, Ikuta, et al., 1982 | gas phase; B |
Free energy of reaction
ΔrG° (kcal/mol) | T (K) | Method | Reference | Comment |
---|---|---|---|---|
10.5 | 300. | PHPMS | Paul and Kebarle, 1991 | gas phase; from Ph. D. thesis of S. Chowdhury, Entropy change calculated or estimated; M |
7.7 | 300. | PHPMS | French, Ikuta, et al., 1982 | gas phase; M |
By formula: Cl- + C6H6O = (Cl- • C6H6O)
Quantity | Value | Units | Method | Reference | Comment |
---|---|---|---|---|---|
ΔrH° | 26.0 ± 2.0 | kcal/mol | TDAs | French, Ikuta, et al., 1982 | gas phase; B,M |
ΔrH° | 26.0 ± 2.0 | kcal/mol | TDEq | Cummings, French, et al., 1977 | gas phase; Re-anchored to data in French, Ikuta, et al., 1982.; B |
ΔrH° | 27.4 | kcal/mol | PHPMS | Kebarle, 1977 | gas phase; M |
ΔrH° | 26.5 | kcal/mol | PHPMS | Paul and Kebarle, 1990 | gas phase; Entropy change calculated or estimated; M |
ΔrH° | 19.4 ± 2.0 | kcal/mol | TDAs | Yamdagni and Kebarle, 1971 | gas phase; B,M |
Quantity | Value | Units | Method | Reference | Comment |
ΔrS° | 26.0 | cal/mol*K | PHPMS | French, Ikuta, et al., 1982 | gas phase; M |
ΔrS° | 25. | cal/mol*K | PHPMS | Kebarle, 1977 | gas phase; M |
ΔrS° | 25. | cal/mol*K | N/A | Paul and Kebarle, 1990 | gas phase; Entropy change calculated or estimated; M |
ΔrS° | 15.5 | cal/mol*K | PHPMS | Yamdagni and Kebarle, 1971 | gas phase; M |
Quantity | Value | Units | Method | Reference | Comment |
ΔrG° | 19.2 ± 2.0 | kcal/mol | TDAs | French, Ikuta, et al., 1982 | gas phase; B |
ΔrG° | 18.5 ± 2.0 | kcal/mol | TDEq | Cummings, French, et al., 1977 | gas phase; Re-anchored to data in French, Ikuta, et al., 1982.; B |
ΔrG° | 14.8 ± 2.0 | kcal/mol | TDAs | Yamdagni and Kebarle, 1971 | gas phase; B |
Free energy of reaction
ΔrG° (kcal/mol) | T (K) | Method | Reference | Comment |
---|---|---|---|---|
15.9 | 423. | PHPMS | Paul and Kebarle, 1990 | gas phase; Entropy change calculated or estimated; M |
By formula: Cl- + C6H6 = (Cl- • C6H6)
Quantity | Value | Units | Method | Reference | Comment |
---|---|---|---|---|---|
ΔrH° | 6.00 ± 0.46 | kcal/mol | N/A | Tschurl, Ueberfluss, et al., 2007 | gas phase; B |
ΔrH° | 9.4 ± 2.0 | kcal/mol | TDAs | Hiraoka, Mizuse, et al., 1988 | gas phase; B,M |
ΔrH° | 9.90 | kcal/mol | IMRE | Larson and McMahon, 1984, 2 | gas phase; B,M |
ΔrH° | 8.7 | kcal/mol | PHPMS | Paul and Kebarle, 1991 | gas phase; from Ph. D. thesis of S. Chowdhury, Entropy change calculated or estimated; M |
ΔrH° | 10.4 | kcal/mol | PHPMS | Sunner, Nishizawa, et al., 1981 | gas phase; Entropy change calculated or estimated; M |
Quantity | Value | Units | Method | Reference | Comment |
ΔrS° | 17.9 | cal/mol*K | PHPMS | Hiraoka, Mizuse, et al., 1988 | gas phase; M |
ΔrS° | 17. | cal/mol*K | N/A | Paul and Kebarle, 1991 | gas phase; from Ph. D. thesis of S. Chowdhury, Entropy change calculated or estimated; M |
ΔrS° | 17.1 | cal/mol*K | N/A | Larson and McMahon, 1984 | gas phase; switching reaction(Cl-)t-C4H9OH, Entropy change calculated or estimated; French, Ikuta, et al., 1982; M |
ΔrS° | 22. | cal/mol*K | N/A | Sunner, Nishizawa, et al., 1981 | gas phase; Entropy change calculated or estimated; M |
Quantity | Value | Units | Method | Reference | Comment |
ΔrG° | 4.0 ± 2.6 | kcal/mol | TDAs | Hiraoka, Mizuse, et al., 1988 | gas phase; B |
ΔrG° | 3.8 ± 1.6 | kcal/mol | IMRE | Chowdhury and Kebarle, 1986 | gas phase; B |
ΔrG° | 4.8 ± 2.0 | kcal/mol | IMRE | Larson and McMahon, 1984, 2 | gas phase; B,M |
ΔrG° | 3.80 | kcal/mol | IMRE | French, Ikuta, et al., 1982 | gas phase; B |
Free energy of reaction
ΔrG° (kcal/mol) | T (K) | Method | Reference | Comment |
---|---|---|---|---|
3.6 | 300. | PHPMS | Paul and Kebarle, 1991 | gas phase; from Ph. D. thesis of S. Chowdhury, Entropy change calculated or estimated; M |
3.8 | 300. | PHPMS | Chowdhury and Kebarle, 1986 | gas phase; M |
3.8 | 300. | PHPMS | Sunner, Nishizawa, et al., 1981 | gas phase; Entropy change calculated or estimated; M |
By formula: Cl- + C6H11NO3 = (Cl- • C6H11NO3)
Quantity | Value | Units | Method | Reference | Comment |
---|---|---|---|---|---|
ΔrH° | 29.4 | kcal/mol | PHPMS | Meot-Ner (Mautner), 1988 | gas phase; M |
ΔrH° | 29.4 | kcal/mol | PHPMS | Meot-ner, 1988 | gas phase; CH3CO-Ala-OCH3; M |
Quantity | Value | Units | Method | Reference | Comment |
ΔrS° | 28.3 | cal/mol*K | PHPMS | Meot-Ner (Mautner), 1988 | gas phase; M |
ΔrS° | 28.3 | cal/mol*K | PHPMS | Meot-ner, 1988 | gas phase; CH3CO-Ala-OCH3; M |
By formula: (Cl- • C6H11NO3) + C6H11NO3 = (Cl- • 2C6H11NO3)
Quantity | Value | Units | Method | Reference | Comment |
---|---|---|---|---|---|
ΔrH° | 19.8 | kcal/mol | PHPMS | Meot-Ner (Mautner), 1988 | gas phase; M |
ΔrH° | 19.8 | kcal/mol | PHPMS | Meot-ner, 1988 | gas phase; M |
Quantity | Value | Units | Method | Reference | Comment |
ΔrS° | 27.0 | cal/mol*K | PHPMS | Meot-Ner (Mautner), 1988 | gas phase; M |
ΔrS° | 27.0 | cal/mol*K | PHPMS | Meot-ner, 1988 | gas phase; M |
By formula: Cl- + C6H11NO3 = (Cl- • C6H11NO3)
Quantity | Value | Units | Method | Reference | Comment |
---|---|---|---|---|---|
ΔrH° | 29.4 ± 1.0 | kcal/mol | TDAs | Meot-ner, 1988 | gas phase; B |
Quantity | Value | Units | Method | Reference | Comment |
ΔrG° | 20.9 ± 1.0 | kcal/mol | TDAs | Meot-ner, 1988 | gas phase; B |
By formula: Cl- + C6H15B = (Cl- • C6H15B)
Quantity | Value | Units | Method | Reference | Comment |
---|---|---|---|---|---|
ΔrH° | 23.8 ± 2.0 | kcal/mol | IMRE | Larson and McMahon, 1985 | gas phase; B,M |
ΔrH° | 23.8 | kcal/mol | ICR | Larson and McMahon, 1984 | gas phase; switching reaction(Cl-)t-C4H9OH, Entropy change calculated or estimated; French, Ikuta, et al., 1982; M |
Quantity | Value | Units | Method | Reference | Comment |
ΔrS° | 22. | cal/mol*K | N/A | Larson and McMahon, 1985 | gas phase; switching reaction,Thermochemical ladder(t-C4H9OH), Entropy change calculated or estimated; M |
ΔrS° | 22.0 | cal/mol*K | N/A | Larson and McMahon, 1984 | gas phase; switching reaction(Cl-)t-C4H9OH, Entropy change calculated or estimated; French, Ikuta, et al., 1982; M |
Quantity | Value | Units | Method | Reference | Comment |
ΔrG° | 17.2 ± 2.0 | kcal/mol | IMRE | Larson and McMahon, 1985 | gas phase; B,M |
ΔrG° | 17.2 | kcal/mol | ICR | Larson and McMahon, 1984 | gas phase; switching reaction(Cl-)t-C4H9OH, Entropy change calculated or estimated; French, Ikuta, et al., 1982; M |
By formula: Cl- + C7F5N = (Cl- • C7F5N)
Quantity | Value | Units | Method | Reference | Comment |
---|---|---|---|---|---|
ΔrS° | 19.9 | cal/mol*K | PHPMS | Chowdhury and Kebarle, 1986 | gas phase; M |
Quantity | Value | Units | Method | Reference | Comment |
ΔrG° | 13.5 ± 1.6 | kcal/mol | TDAs | Chowdhury and Kebarle, 1986 | gas phase; B |
By formula: Cl- + C7F14 = (Cl- • C7F14)
Quantity | Value | Units | Method | Reference | Comment |
---|---|---|---|---|---|
ΔrG° | <1.80 | kcal/mol | IMRB | Chowdhury and Kebarle, 1986 | gas phase; B |
Free energy of reaction
ΔrG° (kcal/mol) | T (K) | Method | Reference | Comment |
---|---|---|---|---|
1.8 | 300. | PHPMS | Chowdhury and Kebarle, 1986 | gas phase; DG<; M |
By formula: Cl- + C7H4F3NO2 = (Cl- • C7H4F3NO2)
Quantity | Value | Units | Method | Reference | Comment |
---|---|---|---|---|---|
ΔrH° | 19.5 ± 1.0 | kcal/mol | TDAs | Chowdhury and Kebarle, 1986 | gas phase; B,M |
Quantity | Value | Units | Method | Reference | Comment |
ΔrS° | 17.9 | cal/mol*K | PHPMS | Chowdhury and Kebarle, 1986 | gas phase; M |
Quantity | Value | Units | Method | Reference | Comment |
ΔrG° | 14.1 ± 1.6 | kcal/mol | TDAs | Chowdhury and Kebarle, 1986 | gas phase; B |
By formula: Cl- + C7H4N2O2 = (Cl- • C7H4N2O2)
Quantity | Value | Units | Method | Reference | Comment |
---|---|---|---|---|---|
ΔrH° | 20.0 ± 1.0 | kcal/mol | TDAs | Chowdhury and Kebarle, 1986 | gas phase; B,M |
Quantity | Value | Units | Method | Reference | Comment |
ΔrS° | 20.0 | cal/mol*K | PHPMS | Chowdhury and Kebarle, 1986 | gas phase; M |
Quantity | Value | Units | Method | Reference | Comment |
ΔrG° | 14.0 ± 1.6 | kcal/mol | TDAs | Chowdhury and Kebarle, 1986 | gas phase; B |
By formula: Cl- + C7H5NO = (Cl- • C7H5NO)
Quantity | Value | Units | Method | Reference | Comment |
---|---|---|---|---|---|
ΔrH° | 35.1 ± 2.0 | kcal/mol | TDEq | Cummings, French, et al., 1977 | gas phase; Re-anchored to data in French, Ikuta, et al., 1982.; B,M,M |
ΔrH° | 35.3 | kcal/mol | PHPMS | Paul and Kebarle, 1990 | gas phase; Entropy change calculated or estimated; M |
Quantity | Value | Units | Method | Reference | Comment |
ΔrS° | 25. | cal/mol*K | N/A | Paul and Kebarle, 1990 | gas phase; Entropy change calculated or estimated; M |
ΔrS° | 28. | cal/mol*K | N/A | Cummings, French, et al., 1977 | gas phase; switching reaction(Cl-)4-Cl-phenol, Entropy change calculated or estimated; French, Ikuta, et al., 1982; M |
ΔrS° | 26. | cal/mol*K | N/A | Cummings, French, et al., 1977 | gas phase; switching reaction(Cl-)4-F-phenol, Entropy change calculated or estimated; French, Ikuta, et al., 1982; M |
Quantity | Value | Units | Method | Reference | Comment |
ΔrG° | 27.3 ± 2.0 | kcal/mol | TDEq | Cummings, French, et al., 1977 | gas phase; Re-anchored to data in French, Ikuta, et al., 1982.; B |
Free energy of reaction
ΔrG° (kcal/mol) | T (K) | Method | Reference | Comment |
---|---|---|---|---|
24.7 | 423. | PHPMS | Paul and Kebarle, 1990 | gas phase; Entropy change calculated or estimated; M |
26.2 | 300. | PHPMS | Cummings, French, et al., 1977 | gas phase; switching reaction(Cl-)4-Cl-phenol, Entropy change calculated or estimated; French, Ikuta, et al., 1982; M |
25.8 | 300. | PHPMS | Cummings, French, et al., 1977 | gas phase; switching reaction(Cl-)4-F-phenol, Entropy change calculated or estimated; French, Ikuta, et al., 1982; M |
By formula: Cl- + C7H5N = (Cl- • C7H5N)
Quantity | Value | Units | Method | Reference | Comment |
---|---|---|---|---|---|
ΔrH° | 16.0 | kcal/mol | PHPMS | Paul and Kebarle, 1991 | gas phase; from Ph. D. thesis of S. Chowdhury, Entropy change calculated or estimated; M |
Quantity | Value | Units | Method | Reference | Comment |
ΔrS° | 20. | cal/mol*K | N/A | Paul and Kebarle, 1991 | gas phase; from Ph. D. thesis of S. Chowdhury, Entropy change calculated or estimated; M |
Free energy of reaction
ΔrG° (kcal/mol) | T (K) | Method | Reference | Comment |
---|---|---|---|---|
10.0 | 300. | PHPMS | Paul and Kebarle, 1991 | gas phase; from Ph. D. thesis of S. Chowdhury, Entropy change calculated or estimated; M |
By formula: Cl- + C7H7NO2 = (Cl- • C7H7NO2)
Quantity | Value | Units | Method | Reference | Comment |
---|---|---|---|---|---|
ΔrG° | 7.50 | kcal/mol | TDEq | French, Ikuta, et al., 1982 | gas phase; B |
Free energy of reaction
ΔrG° (kcal/mol) | T (K) | Method | Reference | Comment |
---|---|---|---|---|
7.5 | 300. | PHPMS | French, Ikuta, et al., 1982 | gas phase; M |
By formula: Cl- + C7H8O = (Cl- • C7H8O)
Quantity | Value | Units | Method | Reference | Comment |
---|---|---|---|---|---|
ΔrG° | 7.30 | kcal/mol | TDEq | French, Ikuta, et al., 1982 | gas phase; B |
Free energy of reaction
ΔrG° (kcal/mol) | T (K) | Method | Reference | Comment |
---|---|---|---|---|
7.3 | 300. | PHPMS | French, Ikuta, et al., 1982 | gas phase; M |
By formula: Cl- + C7H8O = (Cl- • C7H8O)
Quantity | Value | Units | Method | Reference | Comment |
---|---|---|---|---|---|
ΔrH° | 25.6 ± 2.0 | kcal/mol | TDEq | Cummings, French, et al., 1977 | gas phase; Re-anchored to data in French, Ikuta, et al., 1982.; B,M |
ΔrH° | 25.9 | kcal/mol | PHPMS | Paul and Kebarle, 1990 | gas phase; Entropy change calculated or estimated; M |
Quantity | Value | Units | Method | Reference | Comment |
ΔrS° | 25. | cal/mol*K | N/A | Paul and Kebarle, 1990 | gas phase; Entropy change calculated or estimated; M |
ΔrS° | 26.7 | cal/mol*K | PHPMS | Cummings, French, et al., 1977 | gas phase; M |
Quantity | Value | Units | Method | Reference | Comment |
ΔrG° | 17.9 ± 2.0 | kcal/mol | TDEq | Cummings, French, et al., 1977 | gas phase; Re-anchored to data in French, Ikuta, et al., 1982.; B |
Free energy of reaction
ΔrG° (kcal/mol) | T (K) | Method | Reference | Comment |
---|---|---|---|---|
15.3 | 423. | PHPMS | Paul and Kebarle, 1990 | gas phase; Entropy change calculated or estimated; M |
16.6 | 300. | PHPMS | Cummings, French, et al., 1977 | gas phase; M |
By formula: Cl- + C7H8 = (Cl- • C7H8)
Quantity | Value | Units | Method | Reference | Comment |
---|---|---|---|---|---|
ΔrG° | 4.00 | kcal/mol | TDEq | French, Ikuta, et al., 1982 | gas phase; B |
Free energy of reaction
ΔrG° (kcal/mol) | T (K) | Method | Reference | Comment |
---|---|---|---|---|
4.0 | 300. | PHPMS | French, Ikuta, et al., 1982 | gas phase; M |
By formula: Cl- + C8H8O = (Cl- • C8H8O)
Quantity | Value | Units | Method | Reference | Comment |
---|---|---|---|---|---|
ΔrG° | 9.50 | kcal/mol | TDEq | French, Ikuta, et al., 1982 | gas phase; B |
Free energy of reaction
ΔrG° (kcal/mol) | T (K) | Method | Reference | Comment |
---|---|---|---|---|
7.1 | 421. | PHPMS | French, Ikuta, et al., 1982 | gas phase; M |
By formula: Cl- + C8H10 = (Cl- • C8H10)
Quantity | Value | Units | Method | Reference | Comment |
---|---|---|---|---|---|
ΔrG° | 5.00 | kcal/mol | TDEq | French, Ikuta, et al., 1982 | gas phase; B |
Free energy of reaction
ΔrG° (kcal/mol) | T (K) | Method | Reference | Comment |
---|---|---|---|---|
5.0 | 300. | PHPMS | French, Ikuta, et al., 1982 | gas phase; M |
By formula: Cl- + C8H10 = (Cl- • C8H10)
Quantity | Value | Units | Method | Reference | Comment |
---|---|---|---|---|---|
ΔrG° | 3.90 | kcal/mol | TDEq | French, Ikuta, et al., 1982 | gas phase; B |
Free energy of reaction
ΔrG° (kcal/mol) | T (K) | Method | Reference | Comment |
---|---|---|---|---|
3.9 | 300. | PHPMS | French, Ikuta, et al., 1982 | gas phase; M |
By formula: Cl- + C8H10 = (Cl- • C8H10)
Quantity | Value | Units | Method | Reference | Comment |
---|---|---|---|---|---|
ΔrG° | 3.90 | kcal/mol | TDEq | French, Ikuta, et al., 1982 | gas phase; B |
Free energy of reaction
ΔrG° (kcal/mol) | T (K) | Method | Reference | Comment |
---|---|---|---|---|
4.4 | 300. | PHPMS | French, Ikuta, et al., 1982 | gas phase; M |
By formula: Cl- + C9H10O = (Cl- • C9H10O)
Quantity | Value | Units | Method | Reference | Comment |
---|---|---|---|---|---|
ΔrG° | 10.70 | kcal/mol | TDEq | French, Ikuta, et al., 1982 | gas phase; B |
Free energy of reaction
ΔrG° (kcal/mol) | T (K) | Method | Reference | Comment |
---|---|---|---|---|
8.3 | 421. | PHPMS | French, Ikuta, et al., 1982 | gas phase; M |
By formula: Cl- + C9H12 = (Cl- • C9H12)
Quantity | Value | Units | Method | Reference | Comment |
---|---|---|---|---|---|
ΔrG° | 5.50 | kcal/mol | TDEq | French, Ikuta, et al., 1982 | gas phase; B |
Free energy of reaction
ΔrG° (kcal/mol) | T (K) | Method | Reference | Comment |
---|---|---|---|---|
5.0 | 300. | PHPMS | French, Ikuta, et al., 1982 | gas phase; M |
By formula: Cl- + C9H12 = (Cl- • C9H12)
Quantity | Value | Units | Method | Reference | Comment |
---|---|---|---|---|---|
ΔrG° | 5.00 | kcal/mol | TDEq | French, Ikuta, et al., 1982 | gas phase; B |
Free energy of reaction
ΔrG° (kcal/mol) | T (K) | Method | Reference | Comment |
---|---|---|---|---|
5.5 | 300. | PHPMS | French, Ikuta, et al., 1982 | gas phase; M |
By formula: Cl- + C9H12 = (Cl- • C9H12)
Quantity | Value | Units | Method | Reference | Comment |
---|---|---|---|---|---|
ΔrG° | 4.50 | kcal/mol | TDEq | French, Ikuta, et al., 1982 | gas phase; B |
Free energy of reaction
ΔrG° (kcal/mol) | T (K) | Method | Reference | Comment |
---|---|---|---|---|
4.5 | 300. | PHPMS | French, Ikuta, et al., 1982 | gas phase; M |
By formula: Cl- + C13H12 = (Cl- • C13H12)
Quantity | Value | Units | Method | Reference | Comment |
---|---|---|---|---|---|
ΔrG° | 7.40 | kcal/mol | TDEq | French, Ikuta, et al., 1982 | gas phase; B |
Free energy of reaction
ΔrG° (kcal/mol) | T (K) | Method | Reference | Comment |
---|---|---|---|---|
7.4 | 300. | PHPMS | French, Ikuta, et al., 1982 | gas phase; M |
By formula: Cl- + C19H16 = (Cl- • C19H16)
Quantity | Value | Units | Method | Reference | Comment |
---|---|---|---|---|---|
ΔrG° | 4.10 | kcal/mol | TDEq | French, Ikuta, et al., 1982 | gas phase; B |
Free energy of reaction
ΔrG° (kcal/mol) | T (K) | Method | Reference | Comment |
---|---|---|---|---|
4.1 | 300. | PHPMS | French, Ikuta, et al., 1982 | gas phase; M |
+
= Cl2F2P-
By formula: Cl- + ClF2P = Cl2F2P-
Quantity | Value | Units | Method | Reference | Comment |
---|---|---|---|---|---|
ΔrH° | 23.66 | kcal/mol | N/A | Check, Lobring, et al., 2003 | gas phase; B |
By formula: Cl- + Cl2Nd = (Cl- • Cl2Nd)
Quantity | Value | Units | Method | Reference | Comment |
---|---|---|---|---|---|
ΔrH° | 65.5 ± 3.6 | kcal/mol | TDAs | Kudin, Pogrebnoi, et al., 1993 | gas phase; value altered from reference due to conversion from electron convention to ion convention; B |
+
= Cl3OS-
By formula: Cl- + Cl2OS = Cl3OS-
Quantity | Value | Units | Method | Reference | Comment |
---|---|---|---|---|---|
ΔrH° | 20.4 ± 1.8 | kcal/mol | CIDT | Bachrach, Hayes, et al., 2001 | gas phase; B |
+
= Cl3OSe-
By formula: Cl- + Cl2OSe = Cl3OSe-
Quantity | Value | Units | Method | Reference | Comment |
---|---|---|---|---|---|
ΔrH° | 35.80 | kcal/mol | N/A | Lobring, Hao, et al., 2003 | gas phase; B |
+
= Cl3S-
By formula: Cl- + Cl2S = Cl3S-
Quantity | Value | Units | Method | Reference | Comment |
---|---|---|---|---|---|
ΔrH° | 20.3 ± 1.9 | kcal/mol | CIDT | Gailbreath, Pommerening, et al., 2000 | gas phase; B |
+
= Cl3Se-
By formula: Cl- + Cl2Se = Cl3Se-
Quantity | Value | Units | Method | Reference | Comment |
---|---|---|---|---|---|
ΔrH° | 31.8 ± 2.2 | kcal/mol | CIDT | Lobring, Hao, et al., 2003 | gas phase; B |
By formula: Cl- + Cl2Yb = (Cl- • Cl2Yb)
Quantity | Value | Units | Method | Reference | Comment |
---|---|---|---|---|---|
ΔrH° | >56.40 | kcal/mol | N/A | Kuznetsov, Kudin, et al., 1997 | gas phase; value altered from reference due to conversion from electron convention to ion convention; B |
By formula: Cl- + Cl2 = (Cl- • Cl2)
Quantity | Value | Units | Method | Reference | Comment |
---|---|---|---|---|---|
ΔrH° | 17.0 | kcal/mol | SAMS | Robbiani and Franklin, 1979 | gas phase; based on Cl- + SO2Cl2 <--> Cl3- + SO2; National Bureau of Standards, 1968; M |
+
= Cl3-
Quantity | Value | Units | Method | Reference | Comment |
---|---|---|---|---|---|
ΔrH° | 23.7 ± 1.2 | kcal/mol | CIDT | Nizzi, Pommerening, et al., 1998 | gas phase; B |
ΔrH° | 16.70 | kcal/mol | Ther | Robbiani and Franklin, 1979, 2 | gas phase; ΔG≈+1 kcal for Cl- + SO2Cl2 <=> Cl3- + SO2; B |
ΔrH° | <43.60 | kcal/mol | PDis | Lee, Smith, et al., 1979 | gas phase; B |
By formula: Cl- + Cl3Er = Cl4Er-
Quantity | Value | Units | Method | Reference | Comment |
---|---|---|---|---|---|
ΔrH° | 82.2 ± 5.0 | kcal/mol | TDEq | Kudin, Vorob'ev, et al., 2007 | gas phase; value altered from reference due to conversion from electron convention to ion convention; B |
ΔrH° | 78.1 ± 3.9 | kcal/mol | TDAs | Pogrebnoi, Motalov, et al., 2002 | gas phase; value altered from reference due to change in acidity scale; B |
By formula: Cl- + Cl3Er = Cl7Er2-
Quantity | Value | Units | Method | Reference | Comment |
---|---|---|---|---|---|
ΔrH° | 57.1 ± 8.8 | kcal/mol | TDEq | Kudin, Vorob'ev, et al., 2007 | gas phase; value altered from reference due to conversion from electron convention to ion convention; B |
ΔrH° | 81.2 ± 8.9 | kcal/mol | TDAs | Pogrebnoi, Motalov, et al., 2002 | gas phase; value altered from reference due to change in acidity scale; B |
By formula: Cl- + Cl3Er = Cl10Er3-
Quantity | Value | Units | Method | Reference | Comment |
---|---|---|---|---|---|
ΔrH° | 80. ± 14. | kcal/mol | TDAs | Pogrebnoi, Motalov, et al., 2002 | gas phase; value altered from reference due to change in acidity scale; B |
+
= Cl4FSi-
By formula: Cl- + Cl3FSi = Cl4FSi-
Quantity | Value | Units | Method | Reference | Comment |
---|---|---|---|---|---|
ΔrH° | 27.5 ± 1.7 | kcal/mol | CIDT | Hao, Kaspar, et al., 2005 | gas phase; B |
By formula: Cl- + Cl3La = (Cl- • Cl3La)
Quantity | Value | Units | Method | Reference | Comment |
---|---|---|---|---|---|
ΔrH° | 79.4 ± 4.1 | kcal/mol | TDEq | Kudin, Vorob'ev, et al., 2007 | gas phase; value altered from reference due to conversion from electron convention to ion convention; B |
( • Cl3La) + Cl3La = (
• 2Cl3La)
By formula: (Cl- • Cl3La) + Cl3La = (Cl- • 2Cl3La)
Quantity | Value | Units | Method | Reference | Comment |
---|---|---|---|---|---|
ΔrH° | 32.4 ± 3.5 | kcal/mol | MS | Butman, Kudin, et al., 1987 | gas phase; Knudsen cell; M |
By formula: Cl- + Cl3Lu = (Cl- • Cl3Lu)
Quantity | Value | Units | Method | Reference | Comment |
---|---|---|---|---|---|
ΔrH° | 71.0 ± 3.6 | kcal/mol | TDAs | Pogrebnoi, Kudion, et al., 1997 | gas phase; EA estimated as 3.7±1.0 eV; value altered from reference due to conversion from electron convention to ion convention; B |
ΔrH° | 85.8 ± 2.4 | kcal/mol | TDEq | Kudin, Vorob'ev, et al., 2007 | gas phase; value altered from reference due to conversion from electron convention to ion convention; B |
+
= Cl4OP-
By formula: Cl- + Cl3OP = Cl4OP-
Quantity | Value | Units | Method | Reference | Comment |
---|---|---|---|---|---|
ΔrH° | 10.3 ± 1.2 | kcal/mol | CIDT | Check, Lobring, et al., 2003 | gas phase; B |
+
= Cl4PS-
By formula: Cl- + Cl3PS = Cl4PS-
Quantity | Value | Units | Method | Reference | Comment |
---|---|---|---|---|---|
ΔrH° | 9.80 ± 0.96 | kcal/mol | CIDT | Check, Lobring, et al., 2003 | gas phase; B |
+
= Cl4P-
By formula: Cl- + Cl3P = Cl4P-
Quantity | Value | Units | Method | Reference | Comment |
---|---|---|---|---|---|
ΔrH° | 21.5 ± 1.7 | kcal/mol | CIDT | Walker, Check, et al., 2002 | gas phase; B |
By formula: Cl- + Cl3Sb = Cl4Sb-
Quantity | Value | Units | Method | Reference | Comment |
---|---|---|---|---|---|
ΔrH° | 38.2 ± 1.9 | kcal/mol | CIDT | Walker, Check, et al., 2002 | gas phase; B |
By formula: Cl- + Cl3Sm = Cl4Sm-
Quantity | Value | Units | Method | Reference | Comment |
---|---|---|---|---|---|
ΔrH° | 69.1 ± 3.8 | kcal/mol | TDEq | Khasanshin, Pogrebnoi, et al., 1998 | gas phase; value altered from reference due to conversion from electron convention to ion convention; B |
ΔrH° | 86.5 ± 5.0 | kcal/mol | TDEq | Kudin, Vorob'ev, et al., 2007 | gas phase; value altered from reference due to conversion from electron convention to ion convention; B |
By formula: Cl- + Cl3Tb = Cl4Tb-
Quantity | Value | Units | Method | Reference | Comment |
---|---|---|---|---|---|
ΔrH° | 84.4 ± 4.3 | kcal/mol | TDEq | Kudin, Vorob'ev, et al., 2007 | gas phase; value altered from reference due to conversion from electron convention to ion convention; B |
ΔrH° | 72.7 ± 1.6 | kcal/mol | TDEq | Khasanshin, Kudin, et al., 1999 | gas phase; value altered from reference due to conversion from electron convention to ion convention; B |
By formula: Cl- + Cl3Yb = (Cl- • Cl3Yb)
Quantity | Value | Units | Method | Reference | Comment |
---|---|---|---|---|---|
ΔrH° | 74.3 ± 7.2 | kcal/mol | TDAs | Kuznetsov, Kudin, et al., 1997 | gas phase; value altered from reference due to conversion from electron convention to ion convention; B |
ΔrH° | 83.2 ± 4.5 | kcal/mol | TDEq | Kudin, Vorob'ev, et al., 2007 | gas phase; value altered from reference due to conversion from electron convention to ion convention; B |
+
= Cl5Ge-
By formula: Cl- + Cl4Ge = Cl5Ge-
Quantity | Value | Units | Method | Reference | Comment |
---|---|---|---|---|---|
ΔrH° | 33.7 ± 1.4 | kcal/mol | CIDT | Hao, Kaspar, et al., 2005 | gas phase; B |
By formula: Cl- + Cl4Si = (Cl- • Cl4Si)
Quantity | Value | Units | Method | Reference | Comment |
---|---|---|---|---|---|
ΔrH° | 25.1 ± 1.9 | kcal/mol | CIDT | Hao, Kaspar, et al., 2005 | gas phase; B |
ΔrH° | 24.2 ± 2.0 | kcal/mol | IMRE | Larson and McMahon, 1985 | gas phase; B |
Quantity | Value | Units | Method | Reference | Comment |
ΔrG° | 17.6 ± 2.0 | kcal/mol | IMRE | Larson and McMahon, 1985 | gas phase; B |
+
= Cl5Sn-
By formula: Cl- + Cl4Sn = Cl5Sn-
Quantity | Value | Units | Method | Reference | Comment |
---|---|---|---|---|---|
ΔrH° | 56.2 ± 1.9 | kcal/mol | CIDT | Hao, Kaspar, et al., 2005 | gas phase; B |
By formula: Cl- + Cl4Th = (Cl- • Cl4Th)
Quantity | Value | Units | Method | Reference | Comment |
---|---|---|---|---|---|
ΔrH° | 24.2 | kcal/mol | ICR | Larson and McMahon, 1985 | gas phase; switching reaction,Thermochemical ladder(t-C4H9OH), Entropy change calculated or estimated; M |
Quantity | Value | Units | Method | Reference | Comment |
ΔrS° | 22. | cal/mol*K | N/A | Larson and McMahon, 1985 | gas phase; switching reaction,Thermochemical ladder(t-C4H9OH), Entropy change calculated or estimated; M |
Quantity | Value | Units | Method | Reference | Comment |
ΔrG° | 17.6 | kcal/mol | ICR | Larson and McMahon, 1985 | gas phase; switching reaction,Thermochemical ladder(t-C4H9OH), Entropy change calculated or estimated; M |
By formula: Cl- + DCl = (Cl- • DCl)
Bond type: Hydrogen bond (negative ion to hydride)
Free energy of reaction
ΔrG° (kcal/mol) | T (K) | Method | Reference | Comment |
---|---|---|---|---|
16.8 | 300. | ICR | Larson and McMahon, 1987 | gas phase; switching reaction(Cl-)HCl; Caldwell and Kebarle, 1985; M |
By formula: Cl- + D2O = (Cl- • D2O)
Bond type: Hydrogen bond (negative ion to hydride)
Quantity | Value | Units | Method | Reference | Comment |
---|---|---|---|---|---|
ΔrH° | 14.70 ± 0.20 | kcal/mol | IMRE | Larson and McMahon, 1988 | gas phase; Anchored to Keesee and Castleman, 1980, 22: HOH..Cl- + DOD <=> DOD..Cl- + HOH, Keq=0.77; B |
By formula: Cl- + F2OS = (Cl- • F2OS)
Quantity | Value | Units | Method | Reference | Comment |
---|---|---|---|---|---|
ΔrH° | 17.1 ± 2.0 | kcal/mol | IMRE | Larson and McMahon, 1985 | gas phase; B,M |
Quantity | Value | Units | Method | Reference | Comment |
ΔrS° | 23. | cal/mol*K | N/A | Larson and McMahon, 1985 | gas phase; switching reaction,Thermochemical ladder(Cl-)t-C4H9OH, Entropy change calculated or estimated; M |
Quantity | Value | Units | Method | Reference | Comment |
ΔrG° | 10.2 ± 2.0 | kcal/mol | IMRE | Larson and McMahon, 1985 | gas phase; B,M |
By formula: Cl- + F3OP = (Cl- • F3OP)
Quantity | Value | Units | Method | Reference | Comment |
---|---|---|---|---|---|
ΔrH° | 13.9 ± 2.0 | kcal/mol | IMRE | Larson and McMahon, 1985 | gas phase; B,M |
Quantity | Value | Units | Method | Reference | Comment |
ΔrS° | 21. | cal/mol*K | N/A | Larson and McMahon, 1985 | gas phase; switching reaction,Thermochemical ladder(Cl-)t-C4H9OH, Entropy change calculated or estimated; M |
Quantity | Value | Units | Method | Reference | Comment |
ΔrG° | 7.6 ± 2.0 | kcal/mol | IMRE | Larson and McMahon, 1985 | gas phase; B,M |
By formula: Cl- + F3P = (Cl- • F3P)
Quantity | Value | Units | Method | Reference | Comment |
---|---|---|---|---|---|
ΔrH° | 15.5 ± 2.0 | kcal/mol | IMRE | Larson and McMahon, 1985 | gas phase; B |
ΔrH° | 15.5 | kcal/mol | ICR | Larson and McMahon, 1984 | gas phase; switching reaction(Cl-)t-C4H9OH, Entropy change calculated or estimated; French, Ikuta, et al., 1982; M |
Quantity | Value | Units | Method | Reference | Comment |
ΔrS° | 21.0 | cal/mol*K | N/A | Larson and McMahon, 1984 | gas phase; switching reaction(Cl-)t-C4H9OH, Entropy change calculated or estimated; French, Ikuta, et al., 1982; M |
Quantity | Value | Units | Method | Reference | Comment |
ΔrG° | 9.2 ± 2.0 | kcal/mol | IMRE | Larson and McMahon, 1985 | gas phase; B |
ΔrG° | 9.2 | kcal/mol | ICR | Larson and McMahon, 1984 | gas phase; switching reaction(Cl-)t-C4H9OH, Entropy change calculated or estimated; French, Ikuta, et al., 1982; M |
By formula: Cl- + F4Si = (Cl- • F4Si)
Quantity | Value | Units | Method | Reference | Comment |
---|---|---|---|---|---|
ΔrH° | 23.4 ± 2.0 | kcal/mol | IMRE | Larson and McMahon, 1985 | gas phase; B,M |
Quantity | Value | Units | Method | Reference | Comment |
ΔrS° | 22. | cal/mol*K | N/A | Larson and McMahon, 1985 | gas phase; switching reaction,Thermochemical ladder(Cl-)t-C4H9OH, Entropy change calculated or estimated; M |
Quantity | Value | Units | Method | Reference | Comment |
ΔrG° | 16.8 ± 2.0 | kcal/mol | IMRE | Larson and McMahon, 1985 | gas phase; B,M |
By formula: Cl- + F6S- = (Cl- • F6S-)
Free energy of reaction
ΔrG° (kcal/mol) | T (K) | Method | Reference | Comment |
---|---|---|---|---|
1.8 | 300. | PHPMS | Chowdhury and Kebarle, 1986 | gas phase; DG<; M |
By formula: Cl- + F6S = (Cl- • F6S)
Quantity | Value | Units | Method | Reference | Comment |
---|---|---|---|---|---|
ΔrG° | <1.80 | kcal/mol | IMRB | Chowdhury and Kebarle, 1986 | gas phase; B |
By formula: Cl- + HCl = (Cl- • HCl)
Bond type: Hydrogen bond (negative ion to hydride)
Quantity | Value | Units | Method | Reference | Comment |
---|---|---|---|---|---|
ΔrH° | 29.6 ± 1.0 | kcal/mol | N/A | Metz, Kitsopoulos, et al., 1988 | gas phase; Affinity: shift in apparent EA from lesser-solvated ion. Ignores any neutral-neutral bond.; B |
ΔrH° | 23.8 ± 2.0 | kcal/mol | TDEq | Caldwell and Kebarle, 1985 | gas phase; B,M |
ΔrH° | 23.1 ± 2.0 | kcal/mol | IMRE | Larson and McMahon, 1984, 2 | gas phase; B,M |
ΔrH° | 23.70 ± 0.20 | kcal/mol | TDAs | Yamdagni and Kebarle, 1974 | gas phase; B,M |
ΔrH° | 20.4 | kcal/mol | HPMS | Upschulte, Evans, et al., 1986 | gas phase; From thermochemical cycle(Cl-)H2O/HCl, Entropy change calculated or estimated; Keesee and Castleman, 1980; M |
Quantity | Value | Units | Method | Reference | Comment |
ΔrS° | 22.3 | cal/mol*K | PHPMS | Caldwell and Kebarle, 1985 | gas phase; switching reaction(Cl-)SO2; M |
ΔrS° | 23.5 | cal/mol*K | PHPMS | Yamdagni and Kebarle, 1974 | gas phase; M |
ΔrS° | 23.5 | cal/mol*K | N/A | Larson and McMahon, 1984 | gas phase; switching reaction(Cl-)t-C4H9OH, Entropy change calculated or estimated; French, Ikuta, et al., 1982; M |
ΔrS° | 22.8 | cal/mol*K | N/A | Upschulte, Evans, et al., 1986 | gas phase; From thermochemical cycle(Cl-)H2O/HCl, Entropy change calculated or estimated; Keesee and Castleman, 1980; M |
Quantity | Value | Units | Method | Reference | Comment |
ΔrG° | 16.3 ± 2.0 | kcal/mol | IMRE | Larson and McMahon, 1987 | gas phase; K = 0.60 for HCl..Cl- + DCL <=> DCl..Cl- + HCl, anchored to Larson and McMahon, 1984, 32; B |
ΔrG° | 17.1 ± 2.6 | kcal/mol | TDEq | Caldwell and Kebarle, 1985 | gas phase; B |
ΔrG° | 16.0 ± 2.0 | kcal/mol | IMRE | Larson and McMahon, 1984, 2 | gas phase; B,M |
ΔrG° | 16.70 ± 0.30 | kcal/mol | TDAs | Yamdagni and Kebarle, 1974 | gas phase; B |
ΔrG° | 13.6 | kcal/mol | HPMS | Upschulte, Evans, et al., 1986 | gas phase; From thermochemical cycle(Cl-)H2O/HCl, Entropy change calculated or estimated; Keesee and Castleman, 1980; M |
By formula: (Cl- • HCl) + HCl = (Cl- • 2HCl)
Bond type: Hydrogen bond (negative ion to hydride)
Quantity | Value | Units | Method | Reference | Comment |
---|---|---|---|---|---|
ΔrH° | 15.20 ± 0.20 | kcal/mol | TDAs | Yamdagni and Kebarle, 1974 | gas phase; B,M |
ΔrH° | 14.0 | kcal/mol | PHPMS | Caldwell and Kebarle, 1985 | gas phase; switching reaction(Cl- HCl)SO2; M |
Quantity | Value | Units | Method | Reference | Comment |
ΔrS° | 20.4 | cal/mol*K | PHPMS | Caldwell and Kebarle, 1985 | gas phase; switching reaction(Cl- HCl)SO2; M |
ΔrS° | 24.4 | cal/mol*K | PHPMS | Yamdagni and Kebarle, 1974 | gas phase; M |
Quantity | Value | Units | Method | Reference | Comment |
ΔrG° | 7.90 ± 0.20 | kcal/mol | TDAs | Yamdagni and Kebarle, 1974 | gas phase; B |
By formula: (Cl- • 2HCl) + HCl = (Cl- • 3HCl)
Bond type: Hydrogen bond (negative ion to hydride)
Quantity | Value | Units | Method | Reference | Comment |
---|---|---|---|---|---|
ΔrH° | 11.70 ± 0.30 | kcal/mol | TDAs | Yamdagni and Kebarle, 1974 | gas phase; B,M |
Quantity | Value | Units | Method | Reference | Comment |
ΔrS° | 23.4 | cal/mol*K | PHPMS | Yamdagni and Kebarle, 1974 | gas phase; M |
Quantity | Value | Units | Method | Reference | Comment |
ΔrG° | 4.70 ± 0.30 | kcal/mol | TDAs | Yamdagni and Kebarle, 1974 | gas phase; B |
By formula: (Cl- • 3HCl) + HCl = (Cl- • 4HCl)
Bond type: Hydrogen bond (negative ion to hydride)
Quantity | Value | Units | Method | Reference | Comment |
---|---|---|---|---|---|
ΔrH° | 10.30 ± 0.70 | kcal/mol | TDAs | Yamdagni and Kebarle, 1974 | gas phase; B,M |
Quantity | Value | Units | Method | Reference | Comment |
ΔrS° | 26.7 | cal/mol*K | PHPMS | Yamdagni and Kebarle, 1974 | gas phase; M |
Quantity | Value | Units | Method | Reference | Comment |
ΔrG° | 2.3 ± 1.0 | kcal/mol | TDAs | Yamdagni and Kebarle, 1974 | gas phase; B |
By formula: (Cl- • HCl) + H2O = (Cl- • H2O • HCl)
Bond type: Hydrogen bond (negative ion to hydride)
Quantity | Value | Units | Method | Reference | Comment |
---|---|---|---|---|---|
ΔrH° | 10.5 | kcal/mol | HPMS | Upschulte, Evans, et al., 1986 | gas phase; deuterated, quoted in Keesee and Castleman, 1986; M |
Quantity | Value | Units | Method | Reference | Comment |
ΔrS° | 18.7 | cal/mol*K | HPMS | Upschulte, Evans, et al., 1986 | gas phase; deuterated, quoted in Keesee and Castleman, 1986; M |
By formula: (Cl- • 2HCl) + H2O = (Cl- • H2O • 2HCl)
Bond type: Hydrogen bond (negative ion to hydride)
Quantity | Value | Units | Method | Reference | Comment |
---|---|---|---|---|---|
ΔrH° | 7.6 | kcal/mol | HPMS | Upschulte, Evans, et al., 1986 | gas phase; deuterated, quoted in Keesee and Castleman, 1986; M |
Quantity | Value | Units | Method | Reference | Comment |
ΔrS° | 15.2 | cal/mol*K | HPMS | Upschulte, Evans, et al., 1986 | gas phase; deuterated, quoted in Keesee and Castleman, 1986; M |
By formula: (Cl- • HCl • H2O) + HCl = (Cl- • 2HCl • H2O)
Bond type: Hydrogen bond (negative ion to hydride)
Quantity | Value | Units | Method | Reference | Comment |
---|---|---|---|---|---|
ΔrH° | 12.3 | kcal/mol | HPMS | Upschulte, Evans, et al., 1986 | gas phase; From thermochemical cycle,switching reaction(Cl- H2O) HCl, deuterated; Yamdagni and Kebarle, 1974; M |
Quantity | Value | Units | Method | Reference | Comment |
ΔrS° | 20.9 | cal/mol*K | HPMS | Upschulte, Evans, et al., 1986 | gas phase; From thermochemical cycle,switching reaction(Cl- H2O) HCl, deuterated; Yamdagni and Kebarle, 1974; M |
By formula: (Cl- • HCl) + O2S = (Cl- • O2S • HCl)
Quantity | Value | Units | Method | Reference | Comment |
---|---|---|---|---|---|
ΔrH° | 12.3 | kcal/mol | PHPMS | Caldwell and Kebarle, 1985 | gas phase; M |
Quantity | Value | Units | Method | Reference | Comment |
ΔrS° | 18.5 | cal/mol*K | PHPMS | Caldwell and Kebarle, 1985 | gas phase; M |
By formula: Cl- + HF = (Cl- • HF)
Bond type: Hydrogen bond (negative ion to hydride)
Quantity | Value | Units | Method | Reference | Comment |
---|---|---|---|---|---|
ΔrH° | 21.8 ± 2.0 | kcal/mol | IMRE | Larson and McMahon, 1984, 2 | gas phase; B,M |
Quantity | Value | Units | Method | Reference | Comment |
ΔrS° | 22.5 | cal/mol*K | N/A | Larson and McMahon, 1984, 2 | gas phase; switching reaction(Cl-)SO2, Entropy change calculated or estimated; Larson and McMahon, 1984; M |
Quantity | Value | Units | Method | Reference | Comment |
ΔrG° | 15.1 ± 2.0 | kcal/mol | IMRE | Larson and McMahon, 1984, 2 | gas phase; B,M |
By formula: Cl- + H2O = (Cl- • H2O)
Bond type: Hydrogen bond (negative ion to hydride)
Quantity | Value | Units | Method | Reference | Comment |
---|---|---|---|---|---|
ΔrH° | 15. ± 5. | kcal/mol | AVG | N/A | Average of 11 values; Individual data points |
Quantity | Value | Units | Method | Reference | Comment |
ΔrS° | 19. ± 3. | cal/mol*K | AVG | N/A | Average of 8 values; Individual data points |
Quantity | Value | Units | Method | Reference | Comment |
ΔrG° | 9. ± 4. | kcal/mol | AVG | N/A | Average of 9 values; Individual data points |
By formula: (Cl- • H2O) + CH4O = (Cl- • CH4O • H2O)
Quantity | Value | Units | Method | Reference | Comment |
---|---|---|---|---|---|
ΔrH° | 13.2 | kcal/mol | HPMS | Evans and Keesee, 1991 | gas phase; M |
Quantity | Value | Units | Method | Reference | Comment |
ΔrS° | 20.9 | cal/mol*K | HPMS | Evans and Keesee, 1991 | gas phase; M |
By formula: (Cl- • 2H2O) + CH4O = (Cl- • CH4O • 2H2O)
Quantity | Value | Units | Method | Reference | Comment |
---|---|---|---|---|---|
ΔrH° | 11.4 | kcal/mol | HPMS | Evans and Keesee, 1991 | gas phase; M |
Quantity | Value | Units | Method | Reference | Comment |
ΔrS° | 18.1 | cal/mol*K | HPMS | Evans and Keesee, 1991 | gas phase; M |
By formula: (Cl- • H2O • CH4O) + H2O = (Cl- • 2H2O • CH4O)
Bond type: Hydrogen bond (negative ion to hydride)
Quantity | Value | Units | Method | Reference | Comment |
---|---|---|---|---|---|
ΔrH° | 10.4 | kcal/mol | HPMS | Evans and Keesee, 1991 | gas phase; M |
Quantity | Value | Units | Method | Reference | Comment |
ΔrS° | 15.5 | cal/mol*K | HPMS | Evans and Keesee, 1991 | gas phase; M |
By formula: (Cl- • H2O) + HCl = (Cl- • HCl • H2O)
Bond type: Hydrogen bond (negative ion to hydride)
Quantity | Value | Units | Method | Reference | Comment |
---|---|---|---|---|---|
ΔrH° | 16.0 | kcal/mol | HPMS | Upschulte, Evans, et al., 1986 | gas phase; M |
Quantity | Value | Units | Method | Reference | Comment |
ΔrS° | 21.8 | cal/mol*K | HPMS | Upschulte, Evans, et al., 1986 | gas phase; M |
By formula: (Cl- • 2H2O) + HCl = (Cl- • HCl • 2H2O)
Bond type: Hydrogen bond (negative ion to hydride)
Quantity | Value | Units | Method | Reference | Comment |
---|---|---|---|---|---|
ΔrH° | 13.0 | kcal/mol | HPMS | Upschulte, Evans, et al., 1986 | gas phase; From thermochemical cycle(Cl- 2H2O)H2O, deuterated; Keesee and Castleman, 1980; M |
Quantity | Value | Units | Method | Reference | Comment |
ΔrS° | 21.7 | cal/mol*K | HPMS | Upschulte, Evans, et al., 1986 | gas phase; From thermochemical cycle(Cl- 2H2O)H2O, deuterated; Keesee and Castleman, 1980; M |
By formula: (Cl- • H2O • HCl) + H2O = (Cl- • 2H2O • HCl)
Bond type: Hydrogen bond (negative ion to hydride)
Quantity | Value | Units | Method | Reference | Comment |
---|---|---|---|---|---|
ΔrH° | 9.6 | kcal/mol | HPMS | Upschulte, Evans, et al., 1986 | gas phase; deuterated, quoted in 86 KEE/CAS; M |
Quantity | Value | Units | Method | Reference | Comment |
ΔrS° | 20.4 | cal/mol*K | HPMS | Upschulte, Evans, et al., 1986 | gas phase; deuterated, quoted in 86 KEE/CAS; M |
By formula: (Cl- • H2O) + H2O = (Cl- • 2H2O)
Bond type: Hydrogen bond (negative ion to hydride)
Quantity | Value | Units | Method | Reference | Comment |
---|---|---|---|---|---|
ΔrH° | 13. ± 1. | kcal/mol | AVG | N/A | Average of 7 values; Individual data points |
Quantity | Value | Units | Method | Reference | Comment |
ΔrS° | 21.4 | cal/mol*K | PHPMS | Hiraoka, Mizuse, et al., 1988, 2 | gas phase; M |
ΔrS° | 20.5 | cal/mol*K | HPMS | Keesee and Castleman, 1980 | gas phase; M |
ΔrS° | 20.8 | cal/mol*K | HPMS | Arshadi, Yamdagni, et al., 1970 | gas phase; M |
Quantity | Value | Units | Method | Reference | Comment |
ΔrG° | 6.6 ± 1.0 | kcal/mol | TDAs | Hiraoka and Mizuse, 1987 | gas phase; B |
ΔrG° | 6.50 | kcal/mol | TDAs | Keesee and Castleman, 1980 | gas phase; B |
ΔrG° | 6.5 ± 1.4 | kcal/mol | TDAs | Payzant, Yamdagni, et al., 1971 | gas phase; B |
ΔrG° | 6.50 | kcal/mol | TDAs | Arshadi, Yamdagni, et al., 1970 | gas phase; B |
ΔrG° | 6.7 | kcal/mol | FA | Fehsenfeld and Ferguson, 1974 | gas phase; M |
By formula: (Cl- • 2H2O) + H2O = (Cl- • 3H2O)
Bond type: Hydrogen bond (negative ion to hydride)
Quantity | Value | Units | Method | Reference | Comment |
---|---|---|---|---|---|
ΔrH° | 12. ± 2. | kcal/mol | AVG | N/A | Average of 7 values; Individual data points |
Quantity | Value | Units | Method | Reference | Comment |
ΔrS° | 22.3 | cal/mol*K | PHPMS | Hiraoka, Mizuse, et al., 1988, 2 | gas phase; M |
ΔrS° | 22.4 | cal/mol*K | HPMS | Keesee and Castleman, 1980 | gas phase; M |
ΔrS° | 23.2 | cal/mol*K | HPMS | Arshadi, Yamdagni, et al., 1970 | gas phase; M |
Quantity | Value | Units | Method | Reference | Comment |
ΔrG° | 5.0 ± 0.5 | kcal/mol | AVG | N/A | Average of 6 values; Individual data points |
By formula: (Cl- • 3H2O) + H2O = (Cl- • 4H2O)
Bond type: Hydrogen bond (negative ion to hydride)
Quantity | Value | Units | Method | Reference | Comment |
---|---|---|---|---|---|
ΔrH° | 10.6 ± 1.0 | kcal/mol | TDAs | Hiraoka and Mizuse, 1987 | gas phase; B |
ΔrH° | 9.70 | kcal/mol | N/A | Markovich, Pollack, et al., 1994 | gas phase; For photodissociation plus electron loss. Affinity is difference from lower solvated ion.; B |
ΔrH° | 10.6 ± 0.3 | kcal/mol | PHPMS | Hiraoka, Mizuse, et al., 1988, 2 | gas phase; M |
ΔrH° | 10.90 ± 0.70 | kcal/mol | TDAs | Keesee and Castleman, 1980 | gas phase; B,M |
ΔrH° | 11.1 ± 1.0 | kcal/mol | TDAs | Arshadi, Yamdagni, et al., 1970 | gas phase; B,M |
Quantity | Value | Units | Method | Reference | Comment |
ΔrS° | 22.7 | cal/mol*K | PHPMS | Hiraoka, Mizuse, et al., 1988, 2 | gas phase; M |
ΔrS° | 24.8 | cal/mol*K | HPMS | Keesee and Castleman, 1980 | gas phase; M |
ΔrS° | 25.8 | cal/mol*K | HPMS | Arshadi, Yamdagni, et al., 1970 | gas phase; M |
Quantity | Value | Units | Method | Reference | Comment |
ΔrG° | 3.8 ± 1.0 | kcal/mol | TDAs | Hiraoka and Mizuse, 1987 | gas phase; B |
ΔrG° | 3.50 | kcal/mol | TDAs | Keesee and Castleman, 1980 | gas phase; B |
ΔrG° | 3.40 | kcal/mol | TDAs | Arshadi, Yamdagni, et al., 1970 | gas phase; B |
ΔrG° | 4.0 ± 2.0 | kcal/mol | TDAs | Kebarle, Arshadi, et al., 1968 | gas phase; B,M |
By formula: (Cl- • 4H2O) + H2O = (Cl- • 5H2O)
Bond type: Hydrogen bond (negative ion to hydride)
Quantity | Value | Units | Method | Reference | Comment |
---|---|---|---|---|---|
ΔrH° | 9.5 ± 1.0 | kcal/mol | TDAs | Hiraoka and Mizuse, 1987 | gas phase; B |
ΔrH° | 6.70 | kcal/mol | N/A | Markovich, Pollack, et al., 1994 | gas phase; For photodissociation plus electron loss. Affinity is difference from lower solvated ion.; B |
ΔrH° | 9.5 ± 0.3 | kcal/mol | PHPMS | Hiraoka, Mizuse, et al., 1988, 2 | gas phase; M |
Quantity | Value | Units | Method | Reference | Comment |
ΔrS° | 21.7 | cal/mol*K | PHPMS | Hiraoka, Mizuse, et al., 1988, 2 | gas phase; M |
Quantity | Value | Units | Method | Reference | Comment |
ΔrG° | 3.0 ± 1.0 | kcal/mol | TDAs | Hiraoka and Mizuse, 1987 | gas phase; B |
ΔrG° | 2.9 ± 2.0 | kcal/mol | TDAs | Kebarle, Arshadi, et al., 1968 | gas phase; B,M |
By formula: (Cl- • 5H2O) + H2O = (Cl- • 6H2O)
Bond type: Hydrogen bond (negative ion to hydride)
Quantity | Value | Units | Method | Reference | Comment |
---|---|---|---|---|---|
ΔrH° | 8.8 ± 1.0 | kcal/mol | TDAs | Hiraoka and Mizuse, 1987 | gas phase; B |
ΔrH° | 8.50 | kcal/mol | N/A | Markovich, Pollack, et al., 1994 | gas phase; For photodissociation plus electron loss. Affinity is difference from lower solvated ion.; B |
ΔrH° | 8.8 ± 0.4 | kcal/mol | PHPMS | Hiraoka, Mizuse, et al., 1988, 2 | gas phase; M |
Quantity | Value | Units | Method | Reference | Comment |
ΔrS° | 21.2 | cal/mol*K | PHPMS | Hiraoka, Mizuse, et al., 1988, 2 | gas phase; M |
Quantity | Value | Units | Method | Reference | Comment |
ΔrG° | 2.4 ± 1.0 | kcal/mol | TDAs | Hiraoka and Mizuse, 1987 | gas phase; B |
By formula: (Cl- • 6H2O) + H2O = (Cl- • 7H2O)
Bond type: Hydrogen bond (negative ion to hydride)
Quantity | Value | Units | Method | Reference | Comment |
---|---|---|---|---|---|
ΔrH° | 8.1 ± 1.0 | kcal/mol | TDAs | Hiraoka and Mizuse, 1987 | gas phase; Estimated entropy; single temperature measurement; B |
ΔrH° | 6.90 | kcal/mol | N/A | Markovich, Pollack, et al., 1994 | gas phase; For photodissociation plus electron loss. Affinity is difference from lower solvated ion.; B |
ΔrH° | 8.1 | kcal/mol | PHPMS | Hiraoka, Mizuse, et al., 1988, 2 | gas phase; Entropy change calculated or estimated; M |
Quantity | Value | Units | Method | Reference | Comment |
ΔrS° | 20. | cal/mol*K | N/A | Hiraoka, Mizuse, et al., 1988, 2 | gas phase; Entropy change calculated or estimated; M |
Quantity | Value | Units | Method | Reference | Comment |
ΔrG° | 2.1 ± 1.0 | kcal/mol | TDAs | Hiraoka and Mizuse, 1987 | gas phase; Estimated entropy; single temperature measurement; B |
By formula: (Cl- • H2O) + O2S = (Cl- • O2S • H2O)
Quantity | Value | Units | Method | Reference | Comment |
---|---|---|---|---|---|
ΔrH° | 17.4 | kcal/mol | HPMS | Upschulte, Schelling, et al., 1984 | gas phase; M |
Quantity | Value | Units | Method | Reference | Comment |
ΔrS° | 20.2 | cal/mol*K | HPMS | Upschulte, Schelling, et al., 1984 | gas phase; M |
Free energy of reaction
ΔrG° (kcal/mol) | T (K) | Method | Reference | Comment |
---|---|---|---|---|
11.5 | 296. | HPMS | Fehsenfeld and Ferguson, 1974 | gas phase; switching reaction(Cl- H2O)H2O; M |
By formula: (Cl- • 2H2O) + O2S = (Cl- • O2S • 2H2O)
Quantity | Value | Units | Method | Reference | Comment |
---|---|---|---|---|---|
ΔrH° | 14.1 | kcal/mol | HPMS | Upschulte, Schelling, et al., 1984 | gas phase; From thermochemical cycle; M |
Quantity | Value | Units | Method | Reference | Comment |
ΔrS° | 19.4 | cal/mol*K | HPMS | Upschulte, Schelling, et al., 1984 | gas phase; From thermochemical cycle; M |
Free energy of reaction
ΔrG° (kcal/mol) | T (K) | Method | Reference | Comment |
---|---|---|---|---|
8.4 | 296. | HPMS | Upschulte, Schelling, et al., 1984 | gas phase; From thermochemical cycle; M |
By formula: (Cl- • H2O • O2S) + H2O = (Cl- • 2H2O • O2S)
Bond type: Hydrogen bond (negative ion to hydride)
Quantity | Value | Units | Method | Reference | Comment |
---|---|---|---|---|---|
ΔrH° | 9.30 | kcal/mol | TDAs | Upschulte, Schelling, et al., 1984 | gas phase; B,M |
Quantity | Value | Units | Method | Reference | Comment |
ΔrS° | 19.7 | cal/mol*K | HPMS | Upschulte, Schelling, et al., 1984 | gas phase; M |
Quantity | Value | Units | Method | Reference | Comment |
ΔrG° | 3.40 | kcal/mol | TDAs | Upschulte, Schelling, et al., 1984 | gas phase; B |
By formula: Cl- + H2O2 = (Cl- • H2O2)
Quantity | Value | Units | Method | Reference | Comment |
---|---|---|---|---|---|
ΔrH° | 22.1 ± 1.0 | kcal/mol | TDEq | Bohringer, Fahey, et al., 1984 | gas phase; Relative to HOH..Cl-, Keesee, Lee, et al., 1980; B |
Quantity | Value | Units | Method | Reference | Comment |
ΔrG° | 15.6 ± 1.0 | kcal/mol | TDEq | Bohringer, Fahey, et al., 1984 | gas phase; Relative to HOH..Cl-, Keesee, Lee, et al., 1980; B |
By formula: Cl- + H3N = (Cl- • H3N)
Bond type: Hydrogen bond (negative ion to hydride)
Quantity | Value | Units | Method | Reference | Comment |
---|---|---|---|---|---|
ΔrH° | <7.30 ± 0.40 | kcal/mol | N/A | Tschurl and Boesl, 2008 | gas phase; B |
ΔrH° | 8.20 ± 0.10 | kcal/mol | TDAs | Evans, Keesee, et al., 1987 | gas phase; B,M |
ΔrH° | 8.9 ± 1.2 | kcal/mol | N/A | Markovich, Chesnovsky, et al., 1993 | gas phase; B |
ΔrH° | 10.5 ± 4.0 | kcal/mol | IMRE | Larson and McMahon, 1984, 2 | gas phase; B,M |
Quantity | Value | Units | Method | Reference | Comment |
ΔrS° | 15.4 | cal/mol*K | HPMS | Evans, Keesee, et al., 1987 | gas phase; M |
ΔrS° | 19.9 | cal/mol*K | N/A | Larson and McMahon, 1984, 2 | gas phase; switching reaction(Cl-)CH3F, Entropy change calculated or estimated; Larson and McMahon, 1984; M |
Quantity | Value | Units | Method | Reference | Comment |
ΔrG° | 3.60 ± 0.20 | kcal/mol | TDAs | Evans, Keesee, et al., 1987 | gas phase; B |
ΔrG° | 4.5 ± 2.0 | kcal/mol | IMRE | Larson and McMahon, 1984, 2 | gas phase; B,M |
By formula: Cl- + Kr = (Cl- • Kr)
Quantity | Value | Units | Method | Reference | Comment |
---|---|---|---|---|---|
ΔrH° | 2.20 ± 0.10 | kcal/mol | LPES | Yourshaw, Lenzer, et al., 1998 | gas phase; Given: 0.0957(0.001) eV; B |
ΔrH° | 2.80 ± 0.40 | kcal/mol | TDAs | Wada, Kikkawa, et al., 2007 | gas phase; B |
Quantity | Value | Units | Method | Reference | Comment |
ΔrG° | -2.86 ± 0.40 | kcal/mol | TDAs | Wada, Kikkawa, et al., 2007 | gas phase; B |
By formula: Cl- + N2O = (Cl- • N2O)
Quantity | Value | Units | Method | Reference | Comment |
---|---|---|---|---|---|
ΔrH° | 5.8 ± 0.3 | kcal/mol | PHPMS | Hiraoka, Aruga, et al., 1993 | gas phase; M |
Quantity | Value | Units | Method | Reference | Comment |
ΔrS° | 19.2 | cal/mol*K | PHPMS | Hiraoka, Aruga, et al., 1993 | gas phase; M |
By formula: (Cl- • N2O) + N2O = (Cl- • 2N2O)
Quantity | Value | Units | Method | Reference | Comment |
---|---|---|---|---|---|
ΔrH° | 5.6 ± 0.3 | kcal/mol | PHPMS | Hiraoka, Aruga, et al., 1993 | gas phase; M |
Quantity | Value | Units | Method | Reference | Comment |
ΔrS° | 19.5 | cal/mol*K | PHPMS | Hiraoka, Aruga, et al., 1993 | gas phase; M |
By formula: (Cl- • 2N2O) + N2O = (Cl- • 3N2O)
Quantity | Value | Units | Method | Reference | Comment |
---|---|---|---|---|---|
ΔrH° | 5.1 ± 0.3 | kcal/mol | PHPMS | Hiraoka, Aruga, et al., 1993 | gas phase; M |
Quantity | Value | Units | Method | Reference | Comment |
ΔrS° | 20.0 | cal/mol*K | PHPMS | Hiraoka, Aruga, et al., 1993 | gas phase; M |
By formula: (Cl- • 3N2O) + N2O = (Cl- • 4N2O)
Quantity | Value | Units | Method | Reference | Comment |
---|---|---|---|---|---|
ΔrH° | 4.9 ± 0.3 | kcal/mol | PHPMS | Hiraoka, Aruga, et al., 1993 | gas phase; M |
Quantity | Value | Units | Method | Reference | Comment |
ΔrS° | 20.9 | cal/mol*K | PHPMS | Hiraoka, Aruga, et al., 1993 | gas phase; M |
By formula: (Cl- • 4N2O) + N2O = (Cl- • 5N2O)
Quantity | Value | Units | Method | Reference | Comment |
---|---|---|---|---|---|
ΔrH° | 4.8 | kcal/mol | PHPMS | Hiraoka, Aruga, et al., 1993 | gas phase; Entropy change calculated or estimated; M |
Quantity | Value | Units | Method | Reference | Comment |
ΔrS° | 22. | cal/mol*K | N/A | Hiraoka, Aruga, et al., 1993 | gas phase; Entropy change calculated or estimated; M |
By formula: Cl- + O2S = (Cl- • O2S)
Quantity | Value | Units | Method | Reference | Comment |
---|---|---|---|---|---|
ΔrH° | 22.2 ± 2.0 | kcal/mol | TDAs | Caldwell and Kebarle, 1985 | gas phase; B,M |
ΔrH° | 20.9 ± 2.0 | kcal/mol | IMRE | Larson and McMahon, 1985 | gas phase; B |
ΔrH° | 22.2 ± 2.2 | kcal/mol | TDEq | Bohringer, Fahey, et al., 1984 | gas phase; Relative to HOH..Cl- in Keesee, Lee, et al., 1980; B,M |
ΔrH° | 21.80 ± 0.20 | kcal/mol | TDAs | Keesee, Lee, et al., 1980 | gas phase; B,M |
ΔrH° | 20.9 | kcal/mol | ICR | Larson and McMahon, 1984 | gas phase; switching reaction(Cl-)t-C4H9OH, Entropy change calculated or estimated; French, Ikuta, et al., 1982; M |
Quantity | Value | Units | Method | Reference | Comment |
ΔrS° | 21.6 | cal/mol*K | PHPMS | Caldwell and Kebarle, 1985 | gas phase; M |
ΔrS° | 24.1 | cal/mol*K | N/A | Bohringer, Fahey, et al., 1984 | gas phase; switching reaction(Cl-)H2O), Entropy change calculated or estimated; Keesee and Castleman, 1980; M |
ΔrS° | 20.8 | cal/mol*K | N/A | Larson and McMahon, 1984 | gas phase; switching reaction(Cl-)t-C4H9OH, Entropy change calculated or estimated; French, Ikuta, et al., 1982; M |
ΔrS° | 23.2 | cal/mol*K | HPMS | Keesee, Lee, et al., 1980 | gas phase; M |
Quantity | Value | Units | Method | Reference | Comment |
ΔrG° | 15.7 ± 2.0 | kcal/mol | TDAs | Caldwell and Kebarle, 1985 | gas phase; B |
ΔrG° | 14.7 ± 2.0 | kcal/mol | IMRE | Larson and McMahon, 1985 | gas phase; B |
ΔrG° | 15.0 ± 1.6 | kcal/mol | TDEq | Bohringer, Fahey, et al., 1984 | gas phase; Relative to HOH..Cl- in Keesee, Lee, et al., 1980; B,M |
ΔrG° | 14.80 ± 0.30 | kcal/mol | TDAs | Keesee, Lee, et al., 1980 | gas phase; B |
ΔrG° | 14.7 | kcal/mol | ICR | Larson and McMahon, 1984 | gas phase; switching reaction(Cl-)t-C4H9OH, Entropy change calculated or estimated; French, Ikuta, et al., 1982; M |
Free energy of reaction
ΔrG° (kcal/mol) | T (K) | Method | Reference | Comment |
---|---|---|---|---|
14.2 | 296. | FA | Fehsenfeld and Ferguson, 1974 | gas phase; switching reaction(Cl-)H2O; M |
By formula: (Cl- • O2S) + HCl = (Cl- • HCl • O2S)
Bond type: Hydrogen bond (negative ion to hydride)
Quantity | Value | Units | Method | Reference | Comment |
---|---|---|---|---|---|
ΔrH° | 13.9 | kcal/mol | PHPMS | Caldwell and Kebarle, 1985 | gas phase; From thermochemical cycle; M |
Quantity | Value | Units | Method | Reference | Comment |
ΔrS° | 19.2 | cal/mol*K | PHPMS | Caldwell and Kebarle, 1985 | gas phase; From thermochemical cycle; M |
By formula: (Cl- • O2S) + H2O = (Cl- • H2O • O2S)
Bond type: Hydrogen bond (negative ion to hydride)
Quantity | Value | Units | Method | Reference | Comment |
---|---|---|---|---|---|
ΔrH° | 10.40 | kcal/mol | TDAs | Upschulte, Schelling, et al., 1984 | gas phase; B,M |
Quantity | Value | Units | Method | Reference | Comment |
ΔrS° | 19.4 | cal/mol*K | HPMS | Upschulte, Schelling, et al., 1984 | gas phase; M |
Quantity | Value | Units | Method | Reference | Comment |
ΔrG° | 4.60 | kcal/mol | TDAs | Upschulte, Schelling, et al., 1984 | gas phase; B |
Free energy of reaction
ΔrG° (kcal/mol) | T (K) | Method | Reference | Comment |
---|---|---|---|---|
5.5 | 296. | FA | Fehsenfeld and Ferguson, 1974 | gas phase; From thermochemical cycle,switching reaction(H2O/SO2); M |
By formula: (Cl- • 2O2S) + H2O = (Cl- • H2O • 2O2S)
Bond type: Hydrogen bond (negative ion to hydride)
Quantity | Value | Units | Method | Reference | Comment |
---|---|---|---|---|---|
ΔrH° | 9.90 | kcal/mol | TDAs | Upschulte, Schelling, et al., 1984 | gas phase; B,M |
Quantity | Value | Units | Method | Reference | Comment |
ΔrS° | 22.7 | cal/mol*K | HPMS | Upschulte, Schelling, et al., 1984 | gas phase; M |
Quantity | Value | Units | Method | Reference | Comment |
ΔrG° | 3.10 | kcal/mol | TDAs | Upschulte, Schelling, et al., 1984 | gas phase; B |
By formula: (Cl- • O2S • H2O) + O2S = (Cl- • 2O2S • H2O)
Quantity | Value | Units | Method | Reference | Comment |
---|---|---|---|---|---|
ΔrH° | 11.8 | kcal/mol | HPMS | Upschulte, Schelling, et al., 1984 | gas phase; From thermochemical cycle; M |
Quantity | Value | Units | Method | Reference | Comment |
ΔrS° | 26.0 | cal/mol*K | HPMS | Upschulte, Schelling, et al., 1984 | gas phase; From thermochemical cycle; M |
Free energy of reaction
ΔrG° (kcal/mol) | T (K) | Method | Reference | Comment |
---|---|---|---|---|
4.1 | 296. | HPMS | Upschulte, Schelling, et al., 1984 | gas phase; From thermochemical cycle; M |
By formula: (Cl- • O2S) + O2S = (Cl- • 2O2S)
Quantity | Value | Units | Method | Reference | Comment |
---|---|---|---|---|---|
ΔrH° | 12.3 ± 1.0 | kcal/mol | TDAs | Keesee, Lee, et al., 1980 | gas phase; B,M |
ΔrH° | 12.3 | kcal/mol | PHPMS | Caldwell and Kebarle, 1985 | gas phase; M |
Quantity | Value | Units | Method | Reference | Comment |
ΔrS° | 20.2 | cal/mol*K | PHPMS | Caldwell and Kebarle, 1985 | gas phase; M |
ΔrS° | 22.7 | cal/mol*K | HPMS | Keesee, Lee, et al., 1980 | gas phase; M |
Quantity | Value | Units | Method | Reference | Comment |
ΔrG° | 5.5 ± 2.2 | kcal/mol | TDAs | Keesee, Lee, et al., 1980 | gas phase; B |
By formula: (Cl- • 2O2S) + O2S = (Cl- • 3O2S)
Quantity | Value | Units | Method | Reference | Comment |
---|---|---|---|---|---|
ΔrH° | 10.00 ± 0.10 | kcal/mol | TDAs | Keesee, Lee, et al., 1980 | gas phase; B,M |
Quantity | Value | Units | Method | Reference | Comment |
ΔrS° | 23.1 | cal/mol*K | HPMS | Keesee, Lee, et al., 1980 | gas phase; M |
Quantity | Value | Units | Method | Reference | Comment |
ΔrG° | 3.10 ± 0.30 | kcal/mol | TDAs | Keesee, Lee, et al., 1980 | gas phase; B |
By formula: (Cl- • 3O2S) + O2S = (Cl- • 4O2S)
Quantity | Value | Units | Method | Reference | Comment |
---|---|---|---|---|---|
ΔrH° | 8.60 ± 0.20 | kcal/mol | TDAs | Keesee, Lee, et al., 1980 | gas phase; B,M |
Quantity | Value | Units | Method | Reference | Comment |
ΔrS° | 23.2 | cal/mol*K | HPMS | Keesee, Lee, et al., 1980 | gas phase; M |
Quantity | Value | Units | Method | Reference | Comment |
ΔrG° | 1.6 ± 1.0 | kcal/mol | TDAs | Keesee, Lee, et al., 1980 | gas phase; B |
By formula: Cl- + O3S = (Cl- • O3S)
Quantity | Value | Units | Method | Reference | Comment |
---|---|---|---|---|---|
ΔrH° | 53.8 ± 3.1 | kcal/mol | CIDT | Hao, Gilbert, et al., 2006 | gas phase; 0K threshold 53.0 kcal/mol. scaled to 298K with B3LYP data.; B |
By formula: Cl- + Xe = (Cl- • Xe)
Quantity | Value | Units | Method | Reference | Comment |
---|---|---|---|---|---|
ΔrH° | 4.20 ± 0.30 | kcal/mol | TDAs | Wada, Kikkawa, et al., 2007 | gas phase; B |
ΔrH° | 3.10 | kcal/mol | Mobl | Gatland, 1984 | gas phase; B,M |
ΔrH° | 3.10 | kcal/mol | Mobl | Thackston, Eisele, et al., 1980 | gas phase; B,M |
ΔrH° | <3.20 | kcal/mol | Mobl | De Vreugd, Wijnaendts van Resandt, et al., 1979 | gas phase; B |
Quantity | Value | Units | Method | Reference | Comment |
ΔrG° | -1.46 ± 0.30 | kcal/mol | TDAs | Wada, Kikkawa, et al., 2007 | gas phase; B |
+ CAS Reg. No. 10025-71-5 = Cl3Te-
By formula: Cl- + CAS Reg. No. 10025-71-5 = Cl3Te-
Quantity | Value | Units | Method | Reference | Comment |
---|---|---|---|---|---|
ΔrH° | 40.6 ± 1.7 | kcal/mol | CIDT | Lobring, Hao, et al., 2003 | gas phase; B |
+ samarium dichloride = Cl3Sm-
By formula: Cl- + samarium dichloride = Cl3Sm-
Quantity | Value | Units | Method | Reference | Comment |
---|---|---|---|---|---|
ΔrH° | 61.50 ± 0.50 | kcal/mol | TDEq | Khasanshin, Pogrebnoi, et al., 1998 | gas phase; value altered from reference due to conversion from electron convention to ion convention; B |
+ CAS Reg. No. 24422-20-6 = Cl4FGe-
By formula: Cl- + CAS Reg. No. 24422-20-6 = Cl4FGe-
Quantity | Value | Units | Method | Reference | Comment |
---|---|---|---|---|---|
ΔrH° | 39.9 ± 1.7 | kcal/mol | CIDT | Hao, Kaspar, et al., 2005 | gas phase; B |
+ CAS Reg. No. 152748-52-2 = Cl2FSi-
By formula: Cl- + CAS Reg. No. 152748-52-2 = Cl2FSi-
Quantity | Value | Units | Method | Reference | Comment |
---|---|---|---|---|---|
ΔrH° | 49.1 ± 2.0 | kcal/mol | CIDT | Poutsma, Schroeder, et al., 2004 | gas phase; B |
+ CAS Reg. No. 193208-57-0 = Cl4FSn-
By formula: Cl- + CAS Reg. No. 193208-57-0 = Cl4FSn-
Quantity | Value | Units | Method | Reference | Comment |
---|---|---|---|---|---|
ΔrH° | 60.0 ± 2.9 | kcal/mol | CIDT | Hao, Kaspar, et al., 2005 | gas phase; B |

References

Chase, 1998
Chase, M.W., Jr.,
NIST-JANAF Themochemical Tables, Fourth Edition,
J. Phys. Chem. Ref. Data, Monograph 9, 1998, 1-1951. [all data]
Evans and Keesee, 1991
Evans, D.H.; Keesee, R.G.,
Thermodynamics of Gas-Phase Mixed-Solvent Cluster Ions - Water and Methanol on K+ and Cl- and Comparison to Liquid Solutions,
J. Phys. Chem., 1991, 95, 9, 3558, https://doi.org/10.1021/j100162a024
. [all data]
Hiraoka and Mizuse, 1987
Hiraoka, K.; Mizuse, S.,
Gas-Phase Solvation of Cl- with H2O, CH3OH, C2H4OH, i-C3H7OH, n-C3H7OH, and t-C4H9OH,
Chem. Phys., 1987, 118, 3, 457, https://doi.org/10.1016/0301-0104(87)85078-4
. [all data]
Sieck, 1985
Sieck, L.W.,
Thermochemistry of Solvation of NO2- and C6H5NO2- by Polar Molecules in the Vapor Phase. Comparison with Cl- and Variation with Ligand Structure.,
J. Phys. Chem., 1985, 89, 25, 5552, https://doi.org/10.1021/j100271a049
. [all data]
Larson and McMahon, 1984
Larson, J.W.; McMahon, T.B.,
Gas phase negative ion chemistry of alkylchloroformates,
Can. J. Chem., 1984, 62, 675. [all data]
French, Ikuta, et al., 1982
French, M.A.; Ikuta, S.; Kebarle, P.,
Hydrogen bonding of O-H and C-H hydrogen donors to Cl-. Results from mass spectrometric measurement of the ion-molecule equilibria RH + Cl- = RHCl-,
Can. J. Chem., 1982, 60, 1907. [all data]
Yamdagni, Payzant, et al., 1973
Yamdagni, R.; Payzant, J.D.; Kebarle, P.,
Solvation of Cl- and O2- with H2O, CH3OH, and CH3CN in the gas phase,
Can. J. Chem., 1973, 51, 2507. [all data]
Metz, Kitsopoulos, et al., 1988
Metz, R.B.; Kitsopoulos, T.; Weaver, A.; Neumark, D.M.,
Study of the Transition State Region in the Cl+HCl Reaction by Photoelectron Spectroscopy of ClHCl-,
J. Chem. Phys., 1988, 88, 2, 1463, https://doi.org/10.1063/1.454218
. [all data]
Caldwell and Kebarle, 1985
Caldwell, G.; Kebarle, P.,
The hydrogen bond energies of the bihalide ions XHX- and YHX-,
Can. J. Chem., 1985, 63, 1399. [all data]
Larson and McMahon, 1984, 2
Larson, J.W.; McMahon, T.B.,
Hydrogen bonding in gas phase anions. An experimental investigation of the interaction between chloride ion and bronsted acids from ICR chloride exchange equilibria,
J. Am. Chem. Soc., 1984, 106, 517. [all data]
Yamdagni and Kebarle, 1974
Yamdagni, R.; Kebarle, P.,
The hydrogen bond energies in ClHCl- and Cl-(HCl)n,
Can. J. Chem., 1974, 52, 2449. [all data]
Upschulte, Evans, et al., 1986
Upschulte, B.L.; Evans, D.H.; Keesee, R.G.; Castleman, A.W.,
Unpublished results, referred to in Keesee and Castleman, 1986, 1986. [all data]
Keesee and Castleman, 1980
Keesee, R.G.; Castleman, A.W., Jr.,
Gas phase studies of hydration complexes of Cl- and I- and comparison to electrostatic calculations in the gas phase,
Chem. Phys. Lett., 1980, 74, 139. [all data]
Larson and McMahon, 1987
Larson, J.W.; McMahon, T.B.,
Isotope Effects in Proton Transfer Reactions. An Ion Cyclotron Resonance Determination of the Equilibrium Deuterium Isotope Effect in the Bichloride Ion,
J. Phys. Chem., 1987, 91, 3, 554, https://doi.org/10.1021/j100287a013
. [all data]
Larson and McMahon, 1984, 3
Larson, J.W.; McMahon, T.B.,
Fluoride and chloride affinities of main group oxides, fluorides, oxofluorides, and alkyls. Quantitative scales of lewis acidities from ion cyclotron resonance halide-exchange equilibria,
J. Phys. Chem., 1984, 88, 1083. [all data]
Larson and McMahon, 1985
Larson, J.W.; McMahon, T.B.,
Fluoride and chloride affinities of the main group oxides, fluorides, oxofluorides, and alkyls. Quantitative scales of lewis acidities from ICR halide exchange equilibria,
J. Am. Chem. Soc., 1985, 107, 766. [all data]
Bohringer, Fahey, et al., 1984
Bohringer, H.; Fahey, D.W.; Fehsenfeld, F.C.; Ferguson, E.E.,
Bond energies of the molecules H2O, SO2, H2O2, and HCl to various atmospheric negative ions,
J. Chem. Phys., 1984, 81, 2805. [all data]
Keesee, Lee, et al., 1980
Keesee, R.G.; Lee, N.; Castleman, A.W., Jr.,
Properties of clusters in the gas phase: V. Complexes of neutral molecules onto negative ions,
J. Chem. Phys., 1980, 73, 2195. [all data]
Fehsenfeld and Ferguson, 1974
Fehsenfeld, F.C.; Ferguson, E.E.,
Laboratory studies of negative ion reactions with atmospheric trace constituents,
J. Chem. Phys., 1974, 61, 3181. [all data]
Tschurl, Ueberfluss, et al., 2007
Tschurl, M.; Ueberfluss, C.; Boesl, U.,
Anion photoelectron, photodetachment, and infrared dissociation spectra of Cl-center dot C6H6,
Chem. Phys. Lett., 2007, 439, 1-3, 23-28, https://doi.org/10.1016/j.cplett.2007.03.059
. [all data]
Hiraoka, Mizuse, et al., 1988
Hiraoka, K.; Mizuse, S.; Yamabe, S.,
Determination of the Stabilities and Structures of X-(C6H6) Clusters (X = Cl, Br, and I),
Chem. Phys. Lett., 1988, 147, 2-3, 174, https://doi.org/10.1016/0009-2614(88)85078-4
. [all data]
Paul and Kebarle, 1991
Paul, G.J.C.; Kebarle, P.,
Stabilities of Complexes of Br- with Substituted Benzenes (SB) Based on Determinations of the Gas-Phase Equilibria Br- + SB = (BrSB)-,
J. Am. Chem. Soc., 1991, 113, 4, 1148, https://doi.org/10.1021/ja00004a014
. [all data]
Sunner, Nishizawa, et al., 1981
Sunner, J.; Nishizawa, K.; Kebarle, P.,
Ion - Solvent Molecule Interactions in the Gas Phase. Potassium Ion and Benzene,
J. Phys. Chem., 1981, 85, 13, 1814, https://doi.org/10.1021/j150613a011
. [all data]
Chowdhury and Kebarle, 1986
Chowdhury, S.; Kebarle, P.,
Role of Binding Energies in A-.B and A.B- Complexes in the Kinetics of Gas Phase Electron Transfer Reactions:A- + B = A + B- Involving Perfluoro Compounds: SF6, C6F11CF3,
J. Chem. Phys., 1986, 85, 9, 4989, https://doi.org/10.1063/1.451687
. [all data]
Hiraoka, Mizuse, et al., 1988, 2
Hiraoka, K.; Mizuse, S.; Yamabe, S.,
Solvation of Halide Ions with H2O and CH3CN in the Gas Phase,
J. Phys. Chem., 1988, 92, 13, 3943, https://doi.org/10.1021/j100324a051
. [all data]
Arshadi, Yamdagni, et al., 1970
Arshadi, M.; Yamdagni, R.; Kebarle, P.,
Hydration of Halide Negative Ions in the Gas Phase. II. Comparison of Hydration Energies for the Alkali Positive and Halide Negative Ions,
J. Phys. Chem., 1970, 74, 7, 1475, https://doi.org/10.1021/j100702a014
. [all data]
Yamabe, Furumiya, et al., 1986
Yamabe, S.; Furumiya, Y.; Hiraoka, K.; Morise, K.,
Theoretical Van't Hoff plots of gas phase ion equilibria of Cl- ion in water, methanol and acetonitrile,
Chem. Phys. Lett., 1986, 131, 261. [all data]
Yamdagni and Kebarle, 1972
Yamdagni, R.; Kebarle, P.,
Solvation of negative ions by protic and aprotic solvents. Gas phase solvation of halide ions by acetonitrile and water molecules,
J. Am. Chem. Soc., 1972, 94, 2940. [all data]
Li, Ross, et al., 1996
Li, C.; Ross, P.; Szulejko, J.; McMahon, T.B.,
High-Pressure Mass Spectrometric Investigations of the Potential Energy Surfaces of Gas-Phase Sn2 Reactions.,
J. Am. Chem. Soc., 1996, 118, 39, 9360, https://doi.org/10.1021/ja960565o
. [all data]
Payzant, Yamdagni, et al., 1971
Payzant, J.D.; Yamdagni, R.; Kebarle, P.,
Hydration of CN-, NO2-, NO3-, and HO- in the gas phase,
Can. J. Chem., 1971, 49, 3308. [all data]
Kebarle, 1977
Kebarle, P.,
Ion Thermochemistry and Solvation from Gas Phase Ion Equilibria,
Ann. Rev. Phys. Chem., 1977, 28, 1, 445, https://doi.org/10.1146/annurev.pc.28.100177.002305
. [all data]
Yamdagni and Kebarle, 1971
Yamdagni, R.; Kebarle, P.,
Hydrogen bonding energies to negative ions from gas phase measurements of ionic equilibria,
J. Am. Chem. Soc., 1971, 93, 7139. [all data]
Bogdanov, Peschke, et al., 1999
Bogdanov, B.; Peschke, M.; Tonner, D.S.; Szulejko, J.E.; McMahon, T.B.,
Stepwise solvation of halides by alcohol molecules in the gas phase,
Int. J. Mass Spectrom., 1999, 187, 707-725, https://doi.org/10.1016/S1387-3806(98)14180-5
. [all data]
Cummings, French, et al., 1977
Cummings, J.B.; French, M.A.; Kebarle, P.,
Effect of charge delocalization on hydrogen bonding to negative ions and solvation of negative ions. Substituted phenols and phenoxide ions,
J. Am. Chem. Soc., 1977, 99, 6999. [all data]
Paul and Kebarle, 1990
Paul, G.J.C.; Kebarle, P.,
Stabilities in the Gas Phase of the Hydrogen Bonded Complexes, YC6H4OH-X-, of Substituted Phenols, YC6H4OH, with the Halide Anions X-(Cl-, Br-),
Can. J. Chem., 1990, 68, 11, 2070, https://doi.org/10.1139/v90-316
. [all data]
Hiraoka, Takimoto, et al., 1986
Hiraoka, K.; Takimoto, H.; Morise, K.; Shoda, T.; Nakamura, S.,
Ion-Molecule Reactions in Gaseous Acetone,
Bull. Chem. Soc. Japan, 1986, 59, 7, 2247, https://doi.org/10.1246/bcsj.59.2247
. [all data]
Bofdanov and McMahon, 2002
Bofdanov, B.; McMahon, T.B.,
Structures, Thermochemistry, and Infrared Spectra of Chloride Ion-Fluorinated Acetone Complexes and Neutral Fluorinated Acetones in the Gas Phase: Experiment and Theory,
Int. J. Mass Spectrom., 2002, 219, 3, 593-613, https://doi.org/10.1016/S1387-3806(02)00745-5
. [all data]
Hiraoka, Morise, et al., 1986
Hiraoka, K.; Morise, K.; Nishijima, T.; Nakamura, S.; Nakazato, M.; Ohkuma, K.,
Gas Phase Ion Equilibria Studies of Protons and Chloride Ions in Propanol and Acetone,
Int. J. Mass Spectrom. Ion Proc., 1986, 68, 1-2, 99, https://doi.org/10.1016/0168-1176(86)87071-9
. [all data]
Hiraoka, Mizuno, et al., 2001
Hiraoka, K.; Mizuno, T.; Iino, T.; Eguchi, D.; Yamabe, S.,
Characteristic changes of bond energies for gas-phase cluster ions of halide ions with methane and chloromethanes,
J. Phys. Chem. A, 2001, 105, 20, 4887-4893, https://doi.org/10.1021/jp010143n
. [all data]
Giles and Grimsrud, 1993
Giles, K.; Grimsrud, E.P.,
Measurements of Equilibria and Reactivity of Cluster Ions at Atmospheric Pressure - Reactions of Cl-(CHCl3)0-2 with CH3Br and CH3I,
J. Phys. Chem., 1993, 97, 7, 1318, https://doi.org/10.1021/j100109a012
. [all data]
Dougherty, Dalton, et al., 1974
Dougherty, R.C.; Dalton, J.; Roberts, J.D.,
SN2 reactions in the gas phase: Structure of the transition state,
Org. Mass Spectrom., 1974, 8, 77. [all data]
Markovich, Pollack, et al., 1994
Markovich, G.; Pollack, S.; Giniger, R.; Cheshnovsky, O.,
Photoelectron spectroscopy of Cl-, Br-, and I- solvated in water clusters,
J. Chem. Phys., 1994, 101, 11, 9344, https://doi.org/10.1063/1.467965
. [all data]
Kebarle, Arshadi, et al., 1968
Kebarle, P.; Arshadi, M.; Scarborough, J.,
Hydration of Negative Ions in the Gas Phase,
J. Chem. Phys., 1968, 49, 2, 817, https://doi.org/10.1063/1.1670145
. [all data]
Walker and Sunderlin, 1999
Walker, B.W.; Sunderlin, L.S.,
The thermochemistry of formic acid halide anion clusters,
Int. J. Mass Spectrom., 1999, 184, 2-3, 183-189, https://doi.org/10.1016/S1387-3806(99)00008-1
. [all data]
Hiraoka, 1987
Hiraoka, K.,
Relation Between Gas Phase Stepwise and Bulk Solvation of Cl- with Water and Aliphatic Alcohols,
Bull. Chem. Soc. Japan, 1987, 60, 7, 2555, https://doi.org/10.1246/bcsj.60.2555
. [all data]
Riveros, 1974
Riveros, J.M.,
Formation and Relative Stability of Negative Clustered Ions by Ion Cyclotron Resonance Spectroscopy,
Adv. Mass Spectrom., 1974, 6, 277. [all data]
Riveros, Breda, et al., 1973
Riveros, J.M.; Breda, A.C.; Blair, L.K.,
Formation and relative stability of chloride ion clusters in the gas phase by ICR spectroscopy,
J. Am. Chem. Soc., 1973, 95, 4066. [all data]
Martin and Hepburn, 1998
Martin, J.D.D.; Hepburn, J.W.,
Determination of bond dissociation energies by threshold ion-pair production spectroscopy: An improved D-0(HCl),
J. Chem. Phys., 1998, 109, 19, 8139-8142, https://doi.org/10.1063/1.477476
. [all data]
Fujio, McIver, et al., 1981
Fujio, M.; McIver, R.T., Jr.; Taft, R.W.,
Effects on the acidities of phenols from specific substituent-solvent interactions. Inherent substituent parameters from gas phase acidities,
J. Am. Chem. Soc., 1981, 103, 4017. [all data]
Check, Faust, et al., 2001
Check, C.E.; Faust, T.O.; Bailey, J.M.; Wright, B.J.; Gilbert, T.M.; Sunderlin, L.S.,
Addition of Polarization and Diffuse Functions to the LANL2DZ Basis Set for P-Block Elements,
J. Phys. Chem. A,, 2001, 105, 34, 8111, https://doi.org/10.1021/jp011945l
. [all data]
Tschurl and Boesl, 2008
Tschurl, M.; Boesl, U.,
IR-photodissociation and photodetachment spectroscopy of Cl-center dot(NH3)(x) (IR : x=1-4, PD : x=1),
Chem. Phys. Lett., 2008, 456, 4-6, 150-155, https://doi.org/10.1016/j.cplett.2008.03.041
. [all data]
Evans, Keesee, et al., 1987
Evans, D.H.; Keesee, R.G.; Castleman Jr.,
The Association of Ammonia with Halide Ions in the Gas Phase,
J. Chem. Phys., 1987, 86, 5, 2927, https://doi.org/10.1063/1.452043
. [all data]
Markovich, Chesnovsky, et al., 1993
Markovich, G.; Chesnovsky, O.; Kaldor, U.,
Charge Transfer Excitations in the Photoelectron Spectrum of Cl-NH3: Experiment and calculation, J. Chem. Phys, 1993, https://doi.org/10.1063/1.465913
. [all data]
Meot-ner, 1988
Meot-ner, M.,
Ionic Hydrogen Bond and Ion Solvation. 6. Interaction Energies of the Acetate Ion with Organic Molecules. Comparison of CH3COO- with Cl-, CN-, and SH-,
J. Am. Chem. Soc., 1988, 110, 12, 3854, https://doi.org/10.1021/ja00220a022
. [all data]
Meot-ner, Cybulski, et al., 1988
Meot-ner, M.; Cybulski, S.M.; Scheiner, S.; Liebman, J.F.,
Is CN- Significantly Anisotropic? Comparison of CN- vs. Cl-: Clustering with HCN and Condensed Phase Thermochemistry,
J. Phys. Chem., 1988, 92, 10, 2738, https://doi.org/10.1021/j100321a009
. [all data]
Arnold, Bradforth, et al., 1995
Arnold, D.W.; Bradforth, S.E.; Kim, E.H.; Neumark, D.M.,
Study of halogen carbon dioxide clusters and the fluoroformyloxyl radical by photodetachment of X(-)(CO2) (X=I,Cl,Br) and FCO2-,
J. Chem. Phys., 1995, 102, 9, 3493, https://doi.org/10.1063/1.468575
. [all data]
Hiraoka, Shoda, et al., 1986
Hiraoka, K.; Shoda, T.; Morise, K.; Yamabe, S.; Kawai, E.; Hirao, K.,
Stability and structure of cluster ions in the gas phase: Carbon dioxide with Cl-, H3O+, HCO2+ and HCO+,
J. Chem. Phys., 1986, 84, 2091. [all data]
Markovich, Perera, et al., 1996
Markovich, G.; Perera, L.; Berkowitz, M.L.; Cheshnovsky, O.,
The Solvation of Cl-, Br-, and I- in Acetonitrile Cluster: Photoelectron Spectroscopy and Molecular Dynamics Simulations.,
J. Chem. Phys., 1996, 105, 7, 2675, https://doi.org/10.1063/1.472131
. [all data]
Hiraoka, Fujimaki, et al., 1993
Hiraoka, K.; Fujimaki, S.; Aruga, K.; Yamabe, S.,
Bond Strengths of the Gas-Phase Cluster Ions X-(CS2)n (X = F, Cl, Br and I),
Chem. Phys. Lett., 1993, 208, 5-6, 491, https://doi.org/10.1016/0009-2614(93)87178-6
. [all data]
Dougherty and Roberts, 1974
Dougherty, R.C.; Roberts, J.D.,
SN2 reactions in the gas phase. Nucleophilicity effects,
Org. Mass Spectrom., 1974, 8, 81. [all data]
Guerrero, Herrero, et al., 2009
Guerrero, A.; Herrero, R.; Davalos, J.Z.; Koppel, I.; Abboud, J.L.M.; Chana, A.; Koppel, I.A.,
Hydrogen-Bonding Interactions of (CF3)(3)CH and (CF3)(3)C- in the Gas Phase. An Experimental (FT-ICR) and Computational Study,
J. Phys. Chem. A, 2009, 113, 23, 6422-6429, https://doi.org/10.1021/jp811057m
. [all data]
Ziegler, Gamble, et al., 2013
Ziegler, B.E.; Gamble, T.N.; Li, C.; McMahon, T.B.,
Weak Ion-Molecule Interactions in the Gas Phase: A High-Pressure Mass Spectrometry and Computational Study of Chloride-Alkane Interactions,
J. Phys. Chem. A, 2013, 117, 28, 5785-5793, https://doi.org/10.1021/jp403422q
. [all data]
Hammad and Wenthold, 2000
Hammad, L.A.; Wenthold, P.G.,
Synthesis, characterization, and reactivity of the m-xylylene anion in the gas phase. The enthalpy of formation of m-xylylene,
J. Am. Chem. Soc., 2000, 122, 45, 11203-11211, https://doi.org/10.1021/ja002138n
. [all data]
Boesl, Distelrath, et al., 2008
Boesl, U.; Distelrath, V.; Selzle, H.,
The weakly-bound complex Cl center dot N2O studied by high resolution photodetachment photoelectron spectroscopy,
Phys. Chem. Chem. Phys., 2008, 10, 41, 6252-6257, https://doi.org/10.1039/b807992g
. [all data]
Pervova, Korobov, et al., 1992
Pervova, Y.U.; Korobov, M.V.; Sidorov, L.N.,
Enthalpies of Bonds Rupture in AlClnF4-n(-) Anions,
Russ. J. Phys. Chem., 1992, 66, 635. [all data]
Walker, Check, et al., 2002
Walker, B.W.; Check, C.E.; Lobring, K.C.; Pommerening, C.A.; Sunderlin, L.S.,
The Thermochemistry of Group 15 Tetrachloride Anions,
J. Am. Soc. Mass Spectrom., 2002, 13, 5, 469, https://doi.org/10.1016/S1044-0305(02)00369-0
. [all data]
Krivtsov, Titova, et al., 1977
Krivtsov, N.V.; Titova, K.V.; Rosolovskii, V.Ya.,
Thermochemical study of complex borates,
Russ. J. Inorg. Chem., 1977, 22, 374. [all data]
Bogdanov and McMahon, 2006
Bogdanov, B.; McMahon, T.B.,
Gas phase S(N)2 reactions of halide ions with trifluoromethyl halides: Front- and back-side attack vs. complex formation,
J. Phys. Chem. A, 2006, 110, 4, 1350-1363, https://doi.org/10.1021/jp0541011
. [all data]
Luczynski, Wlodek, et al., 1978
Luczynski, Z.; Wlodek, S.; Wincel, H.,
Stabilities of HCOO-.(HCOOH)n and Cl-.(HCOOH)n clusters,
Int. J. Mass Spectrom. Ion Phys., 1978, 26, 103. [all data]
Williamson, Knighton, et al., 1996
Williamson, D.H.; Knighton, W.B.; Grimsrud, E.P.,
Pulsed High Pressure Mass Spectrometry with Near-Viscous Flow Ion Sampling,
Int. J. Mass Spectrom. Ion Proc., 1996, 154, 1-2, 15, https://doi.org/10.1016/0168-1176(96)04372-8
. [all data]
Wincel, 2003
Wincel, H.,
Gas-phase Solvation of Cl-, NO2-, CH2NO2-, CH3NO2-, and CH3NO4- by CH3NO2,
Int. J. Mass Spectrom., 2003, 226, 3, 341-353, https://doi.org/10.1016/S1387-3806(03)00066-6
. [all data]
Staneke, Groothuis, et al., 1995
Staneke, P.O.; Groothuis, G.; Ingemann, S.; Nibbering, N.M.M.,
Formation, stability and structure of radical anions of chloroform, tetrachloromethane and fluorotrichloromethane in the gas phase,
Int. J. Mass Spectrom. Ion Proc., 1995, 142, 1-2, 83, https://doi.org/10.1016/0168-1176(94)04127-S
. [all data]
Hiraoka, Mizuse, et al., 1987
Hiraoka, K.; Mizuse, S.; Yamabe, S.,
Stability and Structure of Cluster Ions: Halide Ions with CO2,
J. Chem. Phys., 1987, 87, 6, 3647, https://doi.org/10.1063/1.452962
. [all data]
Hiraoka, Mochizuki, et al., 2008
Hiraoka, K.; Mochizuki, N.; Wada, A.; Okada, H.; Ichikawa, T.; Asakawa, D.; Yazawa, I.,
Gas-phase ion/molecule reactions in C2F4,
Int. J. Mass Spectrom., 2008, 272, 1, 22-28, https://doi.org/10.1016/j.ijms.2007.12.013
. [all data]
Curtiss, Raghavachari, et al., 7374
Curtiss, L.A.; Raghavachari, K.; Redfern, P.C.; Pople, J.A.,
Assesment of Gaussian-3 and density Functional Theories for a larger experimental test set, J. Chem. Phys. 112 (2000), 7374. [all data]
Bogdanov, Lee, et al., 2001
Bogdanov, B.; Lee, H.J.S.; McMahon, T.B.,
Influence of fluorine substitution on the structures and thermochemistry of chloride ion-ether complexes in the gas phase,
Int. J. Mass Spectrom., 2001, 210, 387-402, https://doi.org/10.1016/S1387-3806(01)00404-3
. [all data]
Magnera, Caldwell, et al., 1984
Magnera, T.F.; Caldwell, G.; Sumner, J.; Ikuta, S.; Kebarle, P.,
Solvation of the halide anions in dimethyl sulfoxide. Factors involved in enhanced reactivity of negative ions in dipolar aprotic solvents,
J. Am. Chem. Soc., 1984, 106, 6140. [all data]
Zhang, Beglinger, et al., 1995
Zhang, W.; Beglinger, C.; Stone, J.A.,
High-pressure mass spectrometric study of the gas-phase association of Cl- with alpha,omega-diols,
J. Phys. Chem., 1995, 99, 30, 11673, https://doi.org/10.1021/j100030a009
. [all data]
Hiraoka, Takao, et al., 2002
Hiraoka, K.; Takao, K.; Lino, T.; Nakagawa, F.; Suyama, H.; Mizuno, T.; Yamabe, S.,
Gas-phase ion-molecule reactions in C3F6,
J. Phys. Chem. A, 2002, 106, 4, 603-611, https://doi.org/10.1021/jp0116306
. [all data]
Hao, Kaspar, et al., 2005
Hao, C.T.; Kaspar, J.D.; Check, C.E.; Lobring, K.C.; Gilbert, T.M.; Sunderlin, L.S.,
Effect of substituents on the strength of A-Cl- (A = Si, Ge, and Sn) bonds in hypervalent systems: ACl(5)(-), ACl(4)F(-), and A(CH3)(3)Cl-2(-),
J. Phys. Chem. A, 2005, 109, 9, 2026-2034, https://doi.org/10.1021/jp040743x
. [all data]
Hiraoka, Fujita, et al., 1905
Hiraoka, K.; Fujita, K.; Ishida, M.; Ichikawa, T.; Okada, H.; Hiizumi, K.; Wada, A.; Takao, K.; Yamabe, S.; Tsuchida, N.,
Gas-phase Ion/Molecule Reactions in C5F8,
J. Phys. Chem. A (2005), 1905, 109, 6, 1049-1056., https://doi.org/10.1021/jp040251k
. [all data]
Lane, Sallans, et al., 1985
Lane, K.R.; Sallans, L.; Squires, R.R.,
Anion affinities of transition metal carbonyls. A thermochemical correlation for iron tetracarbonyl acyl negative ions,
J. Am. Chem. Soc., 1985, 107, 5369. [all data]
Hiraoka, Mizuse, et al., 1987, 2
Hiraoka, K.; Mizuse, S.; Yamabe, S.,
High Symmetric Structure of the Gas Phase Ion Cluster X-..C6F6 (X = Cl, Br, I),
J. Phys. Chem., 1987, 91, 20, 5294, https://doi.org/10.1021/j100304a032
. [all data]
Meot-Ner (Mautner), 1988
Meot-Ner (Mautner), M.,
Models for Strong Interactions in Proteins and Enzymes. 2. Interactions of Ions with the Peptide Link and Imidazole,
J. Am. Chem. Soc., 1988, 110, 10, 3075, https://doi.org/10.1021/ja00218a014
. [all data]
Check, Lobring, et al., 2003
Check, C.E.; Lobring, K.C.; Keating, P.R.; Gilbert, T.M.; Sunderlin, L.S.,
Effect of substituents on the strength of hypervalent phosphorus-halogen bonds,
J. Phys. Chem. A, 2003, 107, 42, 8961-8967, https://doi.org/10.1021/jp030287x
. [all data]
Kudin, Pogrebnoi, et al., 1993
Kudin, L.S.; Pogrebnoi, A.M.; Burdukovskaya, G.G.,
Mass-Spectrometric Study of Saturated Vapor Composition over Neodymium Chlorides .2. Ion-Molecular Equilibrium and Enthalpies of Formation of Formation of Positive and Negative Ions.,
Zh. Fiz. Khim. SSSR, 1993, 67, 908. [all data]
Bachrach, Hayes, et al., 2001
Bachrach, S.M.; Hayes, J.M.; Check, C.E.; Sunderlin, L.S.,
Potential energy surface of SOCl3-,
J. Phys. Chem. A, 2001, 105, 41, 9595-9597, https://doi.org/10.1021/jp012412f
. [all data]
Lobring, Hao, et al., 2003
Lobring, K.C.; Hao, C.T.; Forbes, J.K.; Ivanov, M.R.J.; Bachrach, S.M.; Sunderlin, L.S.,
Bond strengths in ChCl(3)(-) and ChOCl(3)(-) (Ch = S, Se, Te): Experiment and theory,
J. Phys. Chem. A, 2003, 107, 50, 11153-11160, https://doi.org/10.1021/jp030388v
. [all data]
Gailbreath, Pommerening, et al., 2000
Gailbreath, B.D.; Pommerening, C.A.; Bachrach, S.M.; Sunderlin, L.S.,
Potential Energy Surface of SCl3-,
J. Phys. Chem., 2000, 104, 13, 2958, https://doi.org/10.1021/jp993671w
. [all data]
Kuznetsov, Kudin, et al., 1997
Kuznetsov, A.Yu.; Kudin, L.S.; Pogrebnoi, A.M.; Butman, M.F.; Burdukovskaya, G.G.,
A Mass-spectrometric Study of the Neutral and Ionic Components of Ytterbium Chloride Vapor: The Enthalpies of Formation of YbCl2 and YbCl3 Molecules and YbCl3- and YbCl4- Ion in the Gas Phas,
Russ. J. Phys. Chem., 1997, 71, 216. [all data]
Robbiani and Franklin, 1979
Robbiani, R.; Franklin, J.L.,
Negative ion-molecule reaction in sulfuryl halides,
J. Am. Chem. Soc., 1979, 101, 3709. [all data]
National Bureau of Standards, 1968
National Bureau of Standards, US,
Technical Note 270 - 3
in The NBS Tables of Chemical Thermodynamic Properties, 1968. [all data]
Nizzi, Pommerening, et al., 1998
Nizzi, K.E.; Pommerening, C.A.; Sunderlin, L.S.,
Gas-phase thermochemistry of polyhalide anions,
J. Phys. Chem. A, 1998, 102, 39, 7674-7679, https://doi.org/10.1021/jp9824508
. [all data]
Robbiani and Franklin, 1979, 2
Robbiani, R.; Franklin, J.L.,
Formation of the trihalide ion Cl3- in the gas phase,
J. Am. Chem. Soc., 1979, 101, 764. [all data]
Lee, Smith, et al., 1979
Lee, L.C.; Smith, G.P.; Moseley, J.T.; Cosby, P.C.; Guest, J.A.,
Photodissociation and photodetachment of Cl2-, ClO-, Cl3-, and BrCl2-,
J. Chem. Phys., 1979, 70, 3237. [all data]
Kudin, Vorob'ev, et al., 2007
Kudin, L.S.; Vorob'ev, D.E.; Grishin, A.E.,
The Thermochemical Characteristics of the LnCl4- and Ln2Cl7- Negative Ions,
Russ. J. Phys. Chem., 2007, 81, 2, 147, https://doi.org/10.1134/S003602440702001X
. [all data]
Pogrebnoi, Motalov, et al., 2002
Pogrebnoi, A.M.; Motalov, V.B.; Kuznetsov, A.Y.; Kudin, L.S.; Khasanshin, I.V.,
Molecular and ionic associates in the saturated vapor over erbium trichloride and the ErCl3-DyCl3 system,
Russ. J. Inorg. Chem., 2002, 47, 96-100. [all data]
Butman, Kudin, et al., 1987
Butman, M.F.; Kudin, L.S.; Burdukovskaya, G.G.; Krasnov, K.S.; Bozhko, N.V.,
Mass Spectrometric Determination of the Enthalpy of Formation of the Gaseous Ions LaCl4- and La2Cl7-,
Russ. J. Phys. Chem., 1987, 61, 1518. [all data]
Pogrebnoi, Kudion, et al., 1997
Pogrebnoi, A.; Kudion, L.S.; Kuznetsov, A.Yu.; Butman, M.F.,
Molecular and Ionic Clusters in Saturated Vapor over Lutetium Trichloride,
Rapid Commun. Mass Spectrom., 1997, 11, 14, 1536, https://doi.org/10.1002/(SICI)1097-0231(199709)11:14<1536::AID-RCM31>3.0.CO;2-D
. [all data]
Khasanshin, Pogrebnoi, et al., 1998
Khasanshin, I.V.; Pogrebnoi, A.M.; Kudin, L.S.; Kuznetsov, A.Y.; Butman, M.F.,
The Neutral and Ionic Components of Saturated Vapor of Samarium Dichloride: The Thermochemical Characteristics of Gaseous Molecules and Ions,
High Temp., 1998, 36, 687-694. [all data]
Khasanshin, Kudin, et al., 1999
Khasanshin, I.V.; Kudin, L.S.; Pogrebnoi, A.M.,
A mass spectrometric study of saturated vapor over terbium trichloride and the TbCl3-DyCl3 system,
Russ. J. Phys. Chem., 1999, 73, 849-855. [all data]
Larson and McMahon, 1988
Larson, J.W.; McMahon, T.B.,
Equilibrium Isotope Effects on the Hydration of Gas Phase Ions. The Effect of H-Bond Formation on Deuterium Isotopic Fractionation Factors for H3O+,H5O2+,F(HOH)-, and Cl(HOH)-,
J. Am. Chem. Soc., 1988, 110, 4, 1087, https://doi.org/10.1021/ja00212a015
. [all data]
Keesee and Castleman, 1980, 2
Keesee, R.G.; Castleman, A.W., Jr.,
Heats of formation of SO2Cl- and (SO2)2Cl-,
J. Am. Chem. Soc., 1980, 102, 1446. [all data]
Keesee and Castleman, 1986
Keesee, R.G.; Castleman, A.W., Jr.,
Thermochemical data on Ggs-phase ion-molecule association and clustering reactions,
J. Phys. Chem. Ref. Data, 1986, 15, 1011. [all data]
Upschulte, Schelling, et al., 1984
Upschulte, B.L.; Schelling, F.J.; Keesee, R.G.; Castleman, A.W.,
Thermochemical Properties of Gas Phase Mixed Clusters: Water and Sulfur Dioxide with Na+ and Cl-,
Chem. Phys. Lett., 1984, 111, 4-5, 389, https://doi.org/10.1016/0009-2614(84)85526-8
. [all data]
Yourshaw, Lenzer, et al., 1998
Yourshaw, I.; Lenzer, T.; Reiser, G.; Neumark, D.M.,
Zero electron kinetic energy spectroscopy of the KrBr-, XeBr-, and KrCl- anions,
J. Chem. Phys., 1998, 109, 13, 5247-5256, https://doi.org/10.1063/1.477141
. [all data]
Wada, Kikkawa, et al., 2007
Wada, A.; Kikkawa, A.; Sugiyama, T.; Hiraoka, K.,
Thermochemical Stabilities of the Gas-phase Cluster Ions of Halide Ions with Rare Gas Atoms,
Int. J. Mass Spectrom.., 2007, 267, 1-3, 284-287, https://doi.org/10.1016/j.ijms.2007.02.053
. [all data]
Hiraoka, Aruga, et al., 1993
Hiraoka, K.; Aruga, K.; Fujimaki, S.; Yamabe, S.,
Comparative Study of the Gas Phase Bond Strengths of CO2 and N2O with the Halide Ions,
J. Am. Soc. Mass Spectrom., 1993, 4, 1, 58, https://doi.org/10.1016/1044-0305(93)85043-W
. [all data]
Hao, Gilbert, et al., 2006
Hao, C.; Gilbert, T.M.; Sunderlin, L.S.,
The Bond Dissociation Energies of SO3-X- (X = F, Cl, Br, and I),
Can. J. Chem., 2006, 83, 11, 2013-2019, https://doi.org/10.1139/v05-216
. [all data]
Gatland, 1984
Gatland, I.R.,
Determination of Ion-Atom Potentials from Mobility Experiments.
in Swarms of Ions and Electrons In Gases, W. Lindinger, Ed., Springer-Verlag, NY,, 1984, 44. [all data]
Thackston, Eisele, et al., 1980
Thackston, M.G.; Eisele, F.L.; Pope, W.M.; Ellis, H.W.; McDaniel, E.W.; Gatland, I.R.,
Mobility of Cl- ions in Xe gas and the Cl--Xe interaction potential,
J. Chem. Phys., 1980, 73, 3183. [all data]
De Vreugd, Wijnaendts van Resandt, et al., 1979
De Vreugd, C.; Wijnaendts van Resandt, R.W.; Los, J.,
The Well Depths of XeF- and XeCl- from Differential Scattering Measurements,
Chem. Phys. Lett., 1979, 65, 1, 93, https://doi.org/10.1016/0009-2614(79)80134-7
. [all data]
Poutsma, Schroeder, et al., 2004
Poutsma, J.C.; Schroeder, O.E.; Squires, R.R.,
Experimental chloride ion affinities and theoretical predictions for the absolute heats of formation of SiCl2 and SiClF,
Chem. Phys. Lett., 2004, 389, 4-6, 433-437, https://doi.org/10.1016/j.cplett.2004.03.137
. [all data]