Cyclopentane, 1,2,4-trimethyl-, (1α,2β,4α)-
- Formula: C8H16
- Molecular weight: 112.2126
- IUPAC Standard InChIKey: PNUFYSGVPVMNRN-HTQZYQBOSA-N
- CAS Registry Number: 16883-48-0
- Chemical structure:
View 3d structure (requires JavaScript / HTML 5) - Species with the same structure:
- Stereoisomers:
- Other names: Cyclopentane, 1,2,4-trimethyl-, trans,cis-; 1α,2β,4α-Trimethylcyclopentane; 1-trans-2,cis-4-Trimethylcyclopentane; 1-trans-2-trans-4-Trimethylcyclopentane; 1,2,4-Trimethylcyclopentane, trans, trans; trans-1,2,4-trimethylcyclopentane; (1α,2β,4α)-1,2,4-trimethylcyclopentane

Phase change data

Data compiled by: Thermodynamics Research Center, NIST Boulder Laboratories, Chris Muzny director
Quantity | Value | Units | Method | Reference | Comment |
---|---|---|---|---|---|
Tboil | 383. ± 3. | K | AVG | N/A | Average of 7 values; Individual data points |
Quantity | Value | Units | Method | Reference | Comment |
Tfus | 142.17 | K | N/A | Boord, Greenlee, et al., 1949 | Uncertainty assigned by TRC = 0.3 K |
Tfus | 142.37 | K | N/A | Streiff, Murphy, et al., 1947 | Uncertainty assigned by TRC = 0.07 K |

Kovats' RI, non-polar column, isothermal

View large format table.

Column type Active phase Temperature (C) I Reference Comment
CapillaryOV-1010.732.Skrbic, 1997
CapillaryCP Sil 260.744.1Estel, Mohnke, et al., 1995100. m/0.25 mm/0.25 μm
CapillaryOV-10140.738.Laub and Purnell, 1988
CapillaryOV-10160.741.Laub and Purnell, 1988
CapillaryOV-10180.744.Laub and Purnell, 1988
CapillarySqualane50.740.5Lunskii and Paizanskaya, 1988He; Column length: 50. m; Column diameter: 0.22 mm
CapillarySqualane70.743.9Lunskii and Paizanskaya, 1988He; Column length: 50. m; Column diameter: 0.22 mm
CapillaryOV-10140.738.4Boneva and Dimov, 1986100. m/0.27 mm/0.9 μm
CapillaryOV-10150.740.1Boneva and Dimov, 1986100. m/0.27 mm/0.9 μm
CapillaryOV-10160.741.8Boneva and Dimov, 1986100. m/0.27 mm/0.9 μm
CapillaryOV-10170.743.3Boneva and Dimov, 1986100. m/0.27 mm/0.9 μm
CapillarySqualane50.741.0Krupcik, Cellar, et al., 1986Column length: 180. m; Column diameter: 0.25 mm
CapillaryOV-10130.736.Chien, Furio, et al., 1983
CapillaryOV-10140.738.Chien, Furio, et al., 1983
CapillaryOV-10150.739.Chien, Furio, et al., 1983
CapillaryOV-10160.741.Chien, Furio, et al., 1983
CapillaryOV-10170.743.Chien, Furio, et al., 1983
CapillaryOV-10180.744.Chien, Furio, et al., 1983
CapillarySqualane70.744.2Nabivach and Kirilenko, 1979N2; Column length: 50. m
CapillarySqualane70.745.1Nabivach and Kirilenko, 1979N2; Column length: 50. m
CapillarySqualane100.745.2Lulova, Leont'eva, et al., 1976He; Column length: 120. m; Column diameter: 0.25 mm
CapillarySqualane100.745.2Lulova, Leont'eva, et al., 1976He; Column length: 120. m; Column diameter: 0.25 mm
CapillarySqualane50.741.Rijks and Cramers, 1974N2; Column length: 100. m; Column diameter: 0.25 mm
CapillarySqualane70.744.Rijks and Cramers, 1974N2; Column length: 100. m; Column diameter: 0.25 mm
CapillaryVacuum Grease Oil (VM-4)35.739.Sidorov, Petrova, et al., 1972
CapillaryVacuum Grease Oil (VM-4)45.741.Sidorov, Petrova, et al., 1972
CapillaryVacuum Grease Oil (VM-4)50.742.Sidorov, Petrova, et al., 1972
CapillaryVacuum Grease Oil (VM-4)58.744.Sidorov, Petrova, et al., 1972
CapillaryVacuum Grease Oil (VM-4)68.746.Sidorov, Petrova, et al., 1972
CapillarySqualane70.741.3Dimov and Schopov, 1971Column length: 100. m; Column diameter: 0.25 mm
PackedVacuum Grease Oil (VM-4)35.739.Sidorov, Ivanova, et al., 1971
PackedSE-30130.759.Mitra and Saha, 1970N2, Chromosorb W; Column length: 6.1 m
PackedSqualane27.738.Hively and Hinton, 1968He, Chromosorb P; Column length: 15. m; Column diameter: 0.25 mm
PackedSqualane49.741.Hively and Hinton, 1968He, Chromosorb P; Column length: 15. m; Column diameter: 0.25 mm
PackedSqualane67.744.Hively and Hinton, 1968He, Chromosorb P; Column length: 15. m; Column diameter: 0.25 mm
PackedSqualane86.748.Hively and Hinton, 1968He, Chromosorb P; Column length: 15. m; Column diameter: 0.25 mm

Van Den Dool and Kratz RI, non-polar column, temperature ramp

View large format table.

Column type Active phase I Reference Comment
CapillaryPetrocol DH740.4Censullo, Jones, et al., 200350. m/0.25 mm/0.5 μm, He, 35. C @ 10. min, 3. K/min, 200. C @ 10. min
CapillaryOV-101725.9Yin, Liu, et al., 2001N2, 1. K/min; Column length: 80. m; Column diameter: 0.22 mm; Tstart: 30. C; Tend: 130. C
CapillaryOV-101737.8Yin, Liu, et al., 2001N2, 1. K/min; Column length: 80. m; Column diameter: 0.22 mm; Tstart: 30. C; Tend: 130. C
CapillaryPetrocol DH735.05Subramaniam, Bochniak, et al., 1994100. m/0.25 mm/0.5 μm, He, 1. K/min; Tstart: 30. C; Tend: 220. C
CapillaryPetrocol DH735.35White, Douglas, et al., 1992100. m/0.25 mm/0.5 μm, He, 1. K/min; Tstart: 30. C; Tend: 220. C
CapillaryPetrocol DH735.37White, Douglas, et al., 1992100. m/0.25 mm/0.5 μm, He, 1. K/min; Tstart: 30. C; Tend: 220. C
CapillaryPetrocol DH735.White, Hackett, et al., 1992100. m/0.25 mm/0.5 μm, He, 1. K/min; Tstart: 30. C; Tend: 220. C

Normal alkane RI, non-polar column, isothermal

View large format table.

Column type Active phase Temperature (C) I Reference Comment
CapillarySqualane100.749.Krupcik, Cellar, et al., 1986, 2Column length: 180. m; Column diameter: 0.25 mm
CapillarySqualane40.739.Krupcik, Cellar, et al., 1986, 2Column length: 180. m; Column diameter: 0.25 mm
CapillarySqualane70.744.Krupcik, Cellar, et al., 1986, 2Column length: 180. m; Column diameter: 0.25 mm
CapillarySqualane86.736.Vigdergauz and Martynov, 1971He; Column length: 150. m; Column diameter: 0.35 mm

Normal alkane RI, non-polar column, temperature ramp

View large format table.

Column type Active phase I Reference Comment
CapillaryPONA741.Zhang, Ding, et al., 200950. m/0.20 mm/0.50 μm, Nitrogen, 35. C @ 15. min, 2. K/min, 200. C @ 10. min
CapillarySqualane740.4Krupcik, Cellar, et al., 19860.1 K/min; Column length: 100. m; Column diameter: 0.25 mm
CapillarySqualane741.3Krupcik, Cellar, et al., 19860.2 K/min; Column length: 100. m; Column diameter: 0.25 mm
CapillarySqualane742.7Krupcik, Cellar, et al., 19860.4 K/min; Column length: 100. m; Column diameter: 0.25 mm
CapillarySqualane743.9Krupcik, Cellar, et al., 19860.6 K/min; Column length: 100. m; Column diameter: 0.25 mm
CapillarySqualane745.0Krupcik, Cellar, et al., 19860.8 K/min; Column length: 100. m; Column diameter: 0.25 mm
CapillarySqualane745.9Krupcik, Cellar, et al., 19861. K/min; Column length: 100. m; Column diameter: 0.25 mm
CapillarySqualane730.Krupcik, Cellar, et al., 1986, 20.1 K/min; Column length: 180. m; Column diameter: 0.25 mm; Tstart: 40. C
CapillarySqualane741.Krupcik, Cellar, et al., 1986, 20.2 K/min; Column length: 180. m; Column diameter: 0.25 mm; Tstart: 40. C
CapillarySqualane743.Krupcik, Cellar, et al., 1986, 20.4 K/min; Column length: 180. m; Column diameter: 0.25 mm; Tstart: 40. C
CapillarySqualane744.Krupcik, Cellar, et al., 1986, 20.6 K/min; Column length: 180. m; Column diameter: 0.25 mm; Tstart: 40. C
CapillarySqualane745.Krupcik, Cellar, et al., 1986, 20.8 K/min; Column length: 180. m; Column diameter: 0.25 mm; Tstart: 40. C
CapillarySqualane746.Krupcik, Cellar, et al., 1986, 21.0 K/min; Column length: 180. m; Column diameter: 0.25 mm; Tstart: 40. C

Normal alkane RI, non-polar column, custom temperature program

View large format table.

Column type Active phase I Reference Comment
CapillaryMethyl Silicone736.Spieksma, 1999Program: not specified
CapillaryOV-101732.Skrbic and Cvejanov, 1993Program: not specified

References

Boord, Greenlee, et al., 1949
Boord, C.E.; Greenlee, K.W.; Perilstein, W.L.; Derfer, J.M.,
The Synthesis, Purification and Prop. of Hydrocarbons of Low Mol. Wt., Am. Pet. Inst. Res. Proj. 45, Eleventh Annu. Rep., Ohio State Univ., 1949. [all data]
Streiff, Murphy, et al., 1947
Streiff, A.J.; Murphy, E.T.; Cahill, J.C.; Flanagan, H.F.; Sedlak, V.A.; Willingham, C.B.; Rossini, F.D.,
Purification, Purity, and Freezing Points of 8 Nonanes, 11 Alkyl- cyclopentanes, 6 Alkylcyclohexanes, and 4 Butylbenzenes of the API-NBS Series,
J. Res. Natl. Bur. Stand. (U. S.), 1947, 38, 53. [all data]