Phenol, 2-ethyl-6-methyl-
- Formula: C9H12O
- Molecular weight: 136.1910
- IUPAC Standard InChIKey: CIRRFAQIWQFQSS-UHFFFAOYSA-N
- CAS Registry Number: 1687-64-5
- Chemical structure:
View 3d structure (requires JavaScript / HTML 5) - Other names: o-Cresol, 6-ethyl-; 2-Ethyl-6-methylphenol; 6-Ethyl-o-cresol

Phase change data

Data compiled by: Thermodynamics Research Center, NIST Boulder Laboratories, Chris Muzny director
Quantity | Value | Units | Method | Reference | Comment |
---|---|---|---|---|---|
Tboil | 486.15 | K | N/A | Karr, Estep, et al., 1961 | Uncertainty assigned by TRC = 3. K |
Tboil | 486.15 | K | N/A | Karr, 1957 | Uncertainty assigned by TRC = 3. K |
Tboil | 486.15 | K | N/A | Von Auwers, Bundesmann, et al., 1926 | Uncertainty assigned by TRC = 3. K |

References

Karr, Estep, et al., 1961
Karr, C.; Estep, P.A.; Chang, T.-C.L.; Comberiati, H.R.,
, U. S. Bur. Mines, Bull. 591, 1961. [all data]
Karr, 1957
Karr, C.,
, U. S. Bur. Mines, Inform. Circ. IC 7802, 1957. [all data]
Von Auwers, Bundesmann, et al., 1926
Von Auwers, K.; Bundesmann, H.; Wieners, F.,
Justus Liebigs Ann. Chem., 1926, 447, 162. [all data]