Phenol, 2-ethyl-5-methyl-
- Formula: C9H12O
- Molecular weight: 136.1910
- IUPAC Standard InChIKey: LTRVUFFOMIUCPJ-UHFFFAOYSA-N
- CAS Registry Number: 1687-61-2
- Chemical structure:
View 3d structure (requires JavaScript / HTML 5) - Other names: m-Cresol, 6-ethyl-; 2-Ethyl-5-methylphenol; Ethyl-m-cresol; 6-Ethyl-m-cresol; 5-Ethyl-2-methylphenol

Phase change data

Data compiled by: Thermodynamics Research Center, NIST Boulder Laboratories, Chris Muzny director
Quantity | Value | Units | Method | Reference | Comment |
---|---|---|---|---|---|
Tboil | 497.35 | K | N/A | Karr, Estep, et al., 1961 | Uncertainty assigned by TRC = 3. K |
Tboil | 497.35 | K | N/A | Karr, 1957 | Uncertainty assigned by TRC = 3. K |
Tboil | 498.35 | K | N/A | Sy and Lejeune, 1957 | Uncertainty assigned by TRC = 3. K |
Tboil | 497.35 | K | N/A | Kruber, Raeithel, et al., 1955 | Uncertainty assigned by TRC = 3. K |
Quantity | Value | Units | Method | Reference | Comment |
Tfus | 316.55 | K | N/A | Karr, 1957 | Uncertainty assigned by TRC = 2. K |
Tfus | 315.65 | K | N/A | Sy and Lejeune, 1957 | Uncertainty assigned by TRC = 2. K |
Tfus | 316.55 | K | N/A | Kruber, Raeithel, et al., 1955 | Uncertainty assigned by TRC = 2. K |

References

Karr, Estep, et al., 1961
Karr, C.; Estep, P.A.; Chang, T.-C.L.; Comberiati, H.R.,
, U. S. Bur. Mines, Bull. 591, 1961. [all data]
Karr, 1957
Karr, C.,
, U. S. Bur. Mines, Inform. Circ. IC 7802, 1957. [all data]
Sy and Lejeune, 1957
Sy, M.; Lejeune, G.,
The Phenols of Coal Tar,
Chim. Ind. (Paris), 1957, 78, 619. [all data]
Kruber, Raeithel, et al., 1955
Kruber, O.; Raeithel, A.; Grigoleit, G.,
Compounds Proved to Be Present in Coal Tar,
Erdoel Kohle, 1955, 8, 637. [all data]