Deuterium
- Formula: D
- Molecular weight: 2.0141017778
- IUPAC Standard InChIKey: YZCKVEUIGOORGS-OUBTZVSYSA-N
- CAS Registry Number: 16873-17-9
- Chemical structure:

Gas phase thermochemistry data

Quantity | Value | Units | Method | Reference | Comment |
---|---|---|---|---|---|
ΔfH°gas | 52.992 | kcal/mol | Review | Chase, 1998 | Data last reviewed in March, 1982 |
Quantity | Value | Units | Method | Reference | Comment |
S°gas,1 bar | 29.481 | cal/mol*K | Review | Chase, 1998 | Data last reviewed in March, 1982 |
Gas Phase Heat Capacity (Shomate Equation)
Cp° = A + B*t + C*t2 + D*t3 +
E/t2
H° − H°298.15= A*t + B*t2/2 +
C*t3/3 + D*t4/4 − E/t + F − H
S° = A*ln(t) + B*t + C*t2/2 + D*t3/3 −
E/(2*t2) + G
Cp = heat capacity (cal/mol*K)
H° = standard enthalpy (kcal/mol)
S° = standard entropy (cal/mol*K)
t = temperature (K) / 1000.
View plot Requires a JavaScript / HTML 5 canvas capable browser.
Temperature (K) | 298. to 6000. |
---|---|
A | 4.967981 |
B | 1.159331×10-10 |
C | -3.783261×10-11 |
D | 3.645079×10-12 |
E | 7.639451×10-12 |
F | 51.51121 |
G | 35.49340 |
H | 52.99240 |
Reference | Chase, 1998 |
Comment | Data last reviewed in March, 1982 |

Gas phase ion energetics data

Data compiled as indicated in comments:
LBLHLM - Sharon G. Lias, John E. Bartmess, Joel F. Liebman, John L. Holmes, Rhoda D. Levin, and W. Gary Mallard
RDSH - Henry M. Rosenstock, Keith Draxl, Bruce W. Steiner, and John T. Herron
B - John E. Bartmess

Electron affinity determinations

EA (eV) Method Reference Comment
0.754579 ± 0.000087LPESLykke, Murray, et al., 1991Reported: 6086.2±0.6 cm-1. Acid taken as HD -> H+ + D-; B
0.754579 ± 0.000044LPESLykke, Murray, et al., 1991Acid: D2 -> D- + D+. BDE: 105.98 Gurvich, Veyts, et al.. ΔSacid 22.9; B

Ionization energy determinations

IE (eV) Method Reference Comment
13.603SKelly, 1987LBLHLM
13.602SGarcia and Mack, 1965RDSH

References

Chase, 1998
Chase, M.W., Jr.,
NIST-JANAF Themochemical Tables, Fourth Edition,
J. Phys. Chem. Ref. Data, Monograph 9, 1998, 1-1951. [all data]