1,2-Dicarbadodecaborane(12), 1-methyl-

Phase change data

Data compiled by: William E. Acree, Jr., James S. Chickos

Quantity Value Units Method Reference Comment
Δsub63.8 ± 0.6kJ/molN/APilcher and Skinner, 1983See also Miroshnichenko, Pavlovich, et al., 1976.

Gas phase ion energetics data

Data compiled by: Sharon G. Lias and Joel F. Liebman

Ionization energy determinations

IE (eV) Method Reference
9.98PIOrlov, Pustobaev, et al., 1989

References

Pilcher and Skinner, 1983
Pilcher, G.; Skinner, H.A., Thermochemistry of organometallic compounds, 1983, 43-90, https://doi.org/10.1002/9780470771686.ch2 . [all data]

Miroshnichenko, Pavlovich, et al., 1976
Miroshnichenko, E.A.; Pavlovich, V.K.; Lebedev, Yu.A.; Stanko, V.I.; Gal'chenko, G.L., Microcalorimetric determination of enthalpies of sublimation of carboranes, Termodin. Org. Soedin, 1976, 5, 3. [all data]