Triethoxo-oxovanadium
- Formula: C6H15O4V
- Molecular weight: 202.1224
- IUPAC Standard InChIKey: IOHMVQGDVUCILM-UHFFFAOYSA-N
- CAS Registry Number: 1686-22-2
- Chemical structure:
View 3d structure (requires JavaScript / HTML 5) - Other names: Vanadium, triethoxyoxo-, (T-4)-; Triethyl vanadate; triethoxyoxovanadium

Gas phase thermochemistry data

Data compiled by: José A. Martinho Simões
Quantity | Value | Units | Method | Reference | Comment |
---|---|---|---|---|---|
ΔfH°gas | -1014.7 | kJ/mol | Review | Martinho Simões |

Condensed phase thermochemistry data

Data compiled by: José A. Martinho Simões
Quantity | Value | Units | Method | Reference | Comment |
---|---|---|---|---|---|
ΔfH°liquid | -1142.3 ± 7.3 | kJ/mol | Review | Martinho Simões | |
Quantity | Value | Units | Method | Reference | Comment |
ΔcH°liquid | -4138.0 ± 6.7 | kJ/mol | CC-SB | Lachowicz, Trober, et al., 1978 | Temperature: 293 K |

Phase change data

Data compiled by: José A. Martinho Simões
Quantity | Value | Units | Method | Reference | Comment |
---|---|---|---|---|---|
ΔvapH° | 127.6 | kJ/mol | CC-SB | Lachowicz, Trober, et al., 1978 | The enthalpy of vaporization at 298 K, 124.4 kJ/mol, is calculated from data in Lachowicz, Trober, et al., 1978. |

References

Martinho Simões
Martinho Simões, J.A.,
Private communication (see http://webbook.nist.gov/chemistry/om/). [all data]
Lachowicz, Trober, et al., 1978
Lachowicz, A.; Trober, A.; Bieraeugel, I.; Adler, B.,
Investigations on vanadic acid esters. III. Energy data from trialkyl o-vanadates,
Z. Phys. Chem. (Leipzig), 1978, 259, 1121. [all data]