Disulfur difluoride
- Formula: F2S2
- Molecular weight: 102.127
- IUPAC Standard InChIKey: KBYVSSUWTLBZTB-UHFFFAOYSA-N
- CAS Registry Number: 16860-99-4
- Chemical structure:
View 3d structure (requires JavaScript / HTML 5) - Species with the same structure:

Gas phase thermochemistry data

Quantity | Value | Units | Method | Reference | Comment |
---|---|---|---|---|---|
ΔfH°gas | -401.41 | kJ/mol | Review | Chase, 1998 | Data last reviewed in September, 1966 |
Quantity | Value | Units | Method | Reference | Comment |
S°gas,1 bar | 292.80 | J/mol*K | Review | Chase, 1998 | Data last reviewed in September, 1966 |
Gas Phase Heat Capacity (Shomate Equation)
Cp° = A + B*t + C*t2 + D*t3 +
E/t2
H° − H°298.15= A*t + B*t2/2 +
C*t3/3 + D*t4/4 − E/t + F − H
S° = A*ln(t) + B*t + C*t2/2 + D*t3/3 −
E/(2*t2) + G
Cp = heat capacity (J/mol*K)
H° = standard enthalpy (kJ/mol)
S° = standard entropy (J/mol*K)
t = temperature (K) / 1000.
View plot Requires a JavaScript / HTML 5 canvas capable browser.
Temperature (K) | 298. to 2000. | 2000. to 6000. |
---|---|---|
A | 69.74090 | 82.69760 |
B | 23.95960 | 0.313834 |
C | -15.28380 | -0.083492 |
D | 3.293710 | 0.007953 |
E | -1.121800 | -2.371711 |
F | -426.9130 | -433.5430 |
G | 364.3920 | 380.9120 |
H | -401.4130 | -401.4130 |
Reference | Chase, 1998 | Chase, 1998 |
Comment | Data last reviewed in September, 1966 | Data last reviewed in September, 1966 |

Phase change data

Data compiled by: William E. Acree, Jr., James S. Chickos
Enthalpy of vaporization
ΔvapH (kJ/mol) | Temperature (K) | Reference | Comment |
---|---|---|---|
14.9 | 168. | Dykyj, Svoboda, et al., 1999 | Based on data from 153. to 196. K. |

References

Chase, 1998
Chase, M.W., Jr.,
NIST-JANAF Themochemical Tables, Fourth Edition,
J. Phys. Chem. Ref. Data, Monograph 9, 1998, 1-1951. [all data]
Dykyj, Svoboda, et al., 1999
Dykyj, J.; Svoboda, J.; Wilhoit, R.C.; Frenkel, M.L.; Hall, K.R.,
Vapor Pressure of Chemicals: Part A. Vapor Pressure and Antoine Constants for Hydrocarbons and Sulfur, Selenium, Tellurium and Hydrogen Containing Organic Compounds, Springer, Berlin, 1999, 373. [all data]