1H-Indene, 2,3-dihydro-4,6-dimethyl-
- Formula: C11H14
- Molecular weight: 146.2289
- IUPAC Standard InChIKey: BSYQUYXSAFIGLB-UHFFFAOYSA-N
- CAS Registry Number: 1685-82-1
- Chemical structure:

Gas phase thermochemistry data

Data compiled by: Donald R. Burgess, Jr.
Quantity | Value | Units | Method | Reference | Comment |
---|---|---|---|---|---|
ΔfH°gas | -1.4 ± 0.41 | kcal/mol | N/A | Good, 1971 | Value computed using ΔfHliquid° value of -63.7±1.6 kj/mol from Good, 1971 and ΔvapH° value of 57.91±0.41 kj/mol from missing citation. |

Condensed phase thermochemistry data

Data compiled as indicated in comments:
ALS - Hussein Y. Afeefy, Joel F. Liebman, and Stephen E. Stein
DH - Eugene S. Domalski and Elizabeth D. Hearing
Quantity | Value | Units | Method | Reference | Comment |
---|---|---|---|---|---|
ΔfH°liquid | -15.23 ± 0.38 | kcal/mol | Ccb | Good, 1971 | ALS |
Quantity | Value | Units | Method | Reference | Comment |
ΔcH°liquid | -1497.54 ± 0.36 | kcal/mol | Ccb | Good, 1971 | Corresponding ΔfHºliquid = -15.23 kcal/mol (simple calculation by NIST; no Washburn corrections); ALS |
Quantity | Value | Units | Method | Reference | Comment |
S°liquid | 70.60 | cal/mol*K | N/A | Lee-Bechtold, Finke, et al., 1981 | DH |
Constant pressure heat capacity of liquid
Cp,liquid (cal/mol*K) | Temperature (K) | Reference | Comment |
---|---|---|---|
57.58 | 298.15 | Lee-Bechtold, Finke, et al., 1981 | T = 10 to 400 K.; DH |

Phase change data

Data compiled as indicated in comments:
TRC - Thermodynamics Research Center, NIST Boulder Laboratories, Chris Muzny director
ALS - Hussein Y. Afeefy, Joel F. Liebman, and Stephen E. Stein
AC - William E. Acree, Jr., James S. Chickos
DH - Eugene S. Domalski and Elizabeth D. Hearing
Quantity | Value | Units | Method | Reference | Comment |
---|---|---|---|---|---|
Ttriple | 256.45 | K | N/A | Lee-Bechtold, Finke, et al., 1981, 2 | Uncertainty assigned by TRC = 0.01 K; TRC |
Quantity | Value | Units | Method | Reference | Comment |
ΔvapH° | 13.84 ± 0.098 | kcal/mol | V | Osborn and Scott, 1978 | ALS |
ΔvapH° | 13.8 ± 0.1 | kcal/mol | IP,EB | Osborn and Scott, 1978, 2 | Based on data from 313. to 467. K.; AC |
Enthalpy of vaporization
ΔvapH (kcal/mol) | Temperature (K) | Method | Reference | Comment |
---|---|---|---|---|
13.6 | 328. | A,IP,EB | Stephenson and Malanowski, 1987 | Based on data from 313. to 467. K. See also Osborn and Scott, 1978, 2.; AC |
13.5 | 328. | A,IP,EB | Stephenson and Malanowski, 1987 | Based on data from 313. to 363. K. See also Osborn and Scott, 1978, 2.; AC |
12.0 | 430. | A,IP,EB | Stephenson and Malanowski, 1987 | Based on data from 415. to 467. K. See also Osborn and Scott, 1978, 2.; AC |
Enthalpy of fusion
ΔfusH (kcal/mol) | Temperature (K) | Reference | Comment |
---|---|---|---|
3.0786 | 256.45 | Lee-Bechtold, Finke, et al., 1981 | DH |
3.078 | 256.5 | Domalski and Hearing, 1996 | AC |

Van Den Dool and Kratz RI, non-polar column, temperature ramp

Column type | Active phase | I | Reference | Comment |
---|---|---|---|---|
Capillary | Petrocol DH | 1235. | White, Hackett, et al., 1992 | 100. m/0.25 mm/0.5 μm, He, 1. K/min; Tstart: 30. C; Tend: 220. C |

Lee's RI, non-polar column, temperature ramp

Column type | Active phase | I | Reference | Comment |
---|---|---|---|---|
Capillary | DB-5 | 212.38 | Wang, Fingas, et al., 1994 | 30. m/0.32 mm/0.25 μm, He, 50. C @ 2. min, 6. K/min; Tend: 300. C |

References

Good, 1971
Good, W.D.,
The enthalpies of combustion and formation of indan and seven alkylindans,
J. Chem. Thermodyn., 1971, 3, 711-717. [all data]
Lee-Bechtold, Finke, et al., 1981
Lee-Bechtold, S.H.; Finke, H.L.; Messerly, J.F.; Scott, D.W.,
Thermodynamic properties of methyl-substituted indans,
J. Chem. Thermodyn., 1981, 13, 213-228. [all data]
Lee-Bechtold, Finke, et al., 1981, 2
Lee-Bechtold, S.H.; Finke, H.L.; Messerly, J.F.; Scott, D.W.,
Thermodynamic properties of methyl-substitued indans,
J. Chem. Thernodyn., 1981, 13, 213-28. [all data]
Osborn and Scott, 1978
Osborn, A.G.; Scott, D.W.,
J. Chem. Thermodyn., 1978, 10, 619. [all data]
Osborn and Scott, 1978, 2
Osborn, A.G.; Scott, D.W.,
Vapor-pressure and enthalpy of vaporization of indan and five methyl-substituted indans,
The Journal of Chemical Thermodynamics, 1978, 10, 7, 619-628, https://doi.org/10.1016/0021-9614(78)90102-7
. [all data]
Stephenson and Malanowski, 1987
Stephenson, Richard M.; Malanowski, Stanislaw,
Handbook of the Thermodynamics of Organic Compounds, 1987, https://doi.org/10.1007/978-94-009-3173-2
. [all data]
Domalski and Hearing, 1996
Domalski, Eugene S.; Hearing, Elizabeth D.,
Heat Capacities and Entropies of Organic Compounds in the Condensed Phase. Volume III,
J. Phys. Chem. Ref. Data, 1996, 25, 1, 1, https://doi.org/10.1063/1.555985
. [all data]
White, Hackett, et al., 1992
White, C.M.; Hackett, J.; Anderson, R.R.; Kail, S.; Spock, P.S.,
Linear temperature programmed retention indices of gasoline range hydrocarbons and chlorinated hydrocarbons on cross-linked polydimethylsiloxane,
J. Hi. Res. Chromatogr., 1992, 15, 2, 105-120, https://doi.org/10.1002/jhrc.1240150211
. [all data]
Wang, Fingas, et al., 1994
Wang, Z.; Fingas, M.; Li, K.,
Fractionation of a light crude oil and identification and quantitation of aliphatic, aromatic, and biomarker comopunds by GC-FID and GC-MS, Part II,
J. Chromatogr. Sci., 1994, 32, 9, 367-382, https://doi.org/10.1093/chromsci/32.9.367
. [all data]