Propanoic acid, TMS derivative
- Formula: C6H14O2Si
- Molecular weight: 146.2597
- IUPAC Standard InChIKey: QVSRWXFOZLIWJS-UHFFFAOYSA-N
- CAS Registry Number: 16844-98-7
- Chemical structure:
View 3d structure (requires JavaScript / HTML 5) - Other names: Silanol, trimethyl-, propanoate; Silanol, trimethyl-, propionate; Trimethylpropionoxysilane; Trimethylsilyl propionate; Propanoic acid, trimethylsilyl ester; Propionic acid, trimethylsilyl ester

Van Den Dool and Kratz RI, non-polar column, custom temperature program

Column type | Active phase | I | Reference | Comment |
---|---|---|---|---|
Capillary | VF-5MS | 796.2 | Tret'yakov, 2008 | 30. m/0.25 mm/0.25 μm, He; Program: Multi-step temperature program; T(initial)=60C; T(final)=270C |
Capillary | Methyl Silicone | 800. | Peng, Yang, et al., 1991 | Program: not specified |

References

Tret'yakov, 2008
Tret'yakov, K.V.,
Retention Data. NIST Mass Spectrometry Data Center., NIST Mass Spectrometry Data Center, 2008. [all data]
Peng, Yang, et al., 1991
Peng, C.T.; Yang, Z.C.; Maltby, D.,
Prediction of retention indexes. III. Silylated derivatives of polar compounds,
J. Chromatogr., 1991, 586, 1, 113-129, https://doi.org/10.1016/0021-9673(91)80029-G
. [all data]