Naphthalene, 1,2,3,4-tetrahydro-6-methyl-
- Formula: C11H14
- Molecular weight: 146.2289
- IUPAC Standard InChIKey: IVIDJLLPQYHHLM-UHFFFAOYSA-N
- CAS Registry Number: 1680-51-9
- Chemical structure:
View 3d structure (requires JavaScript / HTML 5) - Other names: 6-Methyltetralin; 6-Methyl-(1,2,3,4-tetrahydronaphthalene); Naphthalene, 6-methyl-1,2,3,4-tetrahydro-; 1,2,3,4-Tetrahydro-6-methylnaphthalene; 6-Methyltetraline

Phase change data

Data compiled by: William E. Acree, Jr., James S. Chickos
Enthalpy of vaporization
ΔvapH (kJ/mol) | Temperature (K) | Method | Reference | Comment |
---|---|---|---|---|
53.7 | 426. | A | Stephenson and Malanowski, 1987 | Based on data from 411. to 502. K. |

Reaction thermochemistry data

Data compiled by: Hussein Y. Afeefy, Joel F. Liebman, and Stephen E. Stein
Individual Reactions
By formula: C11H14 = C11H14
Quantity | Value | Units | Method | Reference | Comment |
---|---|---|---|---|---|
ΔrH° | -6.3 | kJ/mol | Eqk | Nieuwstad, Klapwijk, et al., 1973 | liquid phase |

Kovats' RI, non-polar column, isothermal

Column type | Active phase | Temperature (C) | I | Reference | Comment |
---|---|---|---|---|---|
Packed | SE-30 | 150. | 1275. | Shlyakhov, Anvaer, et al., 1975 |

Van Den Dool and Kratz RI, non-polar column, temperature ramp

Column type | Active phase | I | Reference | Comment |
---|---|---|---|---|
Capillary | Petrocol DH | 1246.28 | White, Douglas, et al., 1992 | 100. m/0.25 mm/0.5 μm, He, 1. K/min; Tstart: 30. C; Tend: 220. C |
Capillary | Petrocol DH | 1246.78 | White, Douglas, et al., 1992 | 100. m/0.25 mm/0.5 μm, He, 1. K/min; Tstart: 30. C; Tend: 220. C |
Capillary | Petrocol DH | 1247. | White, Hackett, et al., 1992 | 100. m/0.25 mm/0.5 μm, He, 1. K/min; Tstart: 30. C; Tend: 220. C |

Normal alkane RI, non-polar column, isothermal

Column type | Active phase | Temperature (C) | I | Reference | Comment |
---|---|---|---|---|---|
Packed | Polydimethyl siloxane | 147. | 1262. | Ferrand, 1962 |

Normal alkane RI, non-polar column, custom temperature program

Column type | Active phase | I | Reference | Comment |
---|---|---|---|---|
Capillary | Apieson L | 1254. | Vaisberg and Gizitdinova, 1969 | Helium; Column length: 50. m; Column diameter: 0.25 mm; Program: not specified |

References

Stephenson and Malanowski, 1987
Stephenson, Richard M.; Malanowski, Stanislaw,
Handbook of the Thermodynamics of Organic Compounds, 1987, https://doi.org/10.1007/978-94-009-3173-2
. [all data]
Nieuwstad, Klapwijk, et al., 1973
Nieuwstad, Th.J.; Klapwijk, P.; Van Bekkum, H.,
Hydrogenation of alkyl-substituted naphthalenes over palladium,
J. Catal., 1973, 29, 404-411. [all data]
Shlyakhov, Anvaer, et al., 1975
Shlyakhov, A.F.; Anvaer, B.I.; Zolotareva, O.V.; Romina, N.N.; Novikova, N.V.; Koreshkova, R.I.,
On the possibility of group indentification of hydrocarbons by gas chromatography from temperature coefficients of retention indices,
Zh. Anal. Khim., 1975, 30, 788-792. [all data]
White, Douglas, et al., 1992
White, C.M.; Douglas, L.J.; Hackett, J.P.; Anderson, R.R.,
Characterization of synthetic gasoline from the chloromethane-zeolite reaction,
Energy Fuels, 1992, 6, 1, 76-82, https://doi.org/10.1021/ef00031a012
. [all data]
White, Hackett, et al., 1992
White, C.M.; Hackett, J.; Anderson, R.R.; Kail, S.; Spock, P.S.,
Linear temperature programmed retention indices of gasoline range hydrocarbons and chlorinated hydrocarbons on cross-linked polydimethylsiloxane,
J. Hi. Res. Chromatogr., 1992, 15, 2, 105-120, https://doi.org/10.1002/jhrc.1240150211
. [all data]
Ferrand, 1962
Ferrand, R.,
Gas phase chromatography using retention indices for the analysis of tars and their hydrogenation products,
Journees internationales d'etude des methodes de separation immediate at de chromatographie; Org. sur l'initiative du IX., 1962, 132-140. [all data]
Vaisberg and Gizitdinova, 1969
Vaisberg, K.M.; Gizitdinova, V.G.,
Gas chromatographic investigation of tetralin and its homologues C11-C12,
Neftekhimia (Rus), 1969, 9, 3, 482-486. [all data]