Cyclopentanethiol
- Formula: C5H10S
- Molecular weight: 102.198
- IUPAC Standard InChIKey: WVDYBOADDMMFIY-UHFFFAOYSA-N
- CAS Registry Number: 1679-07-8
- Chemical structure:
View 3d structure (requires JavaScript / HTML 5) - Other names: Cyclopentyl mercaptan; Mercaptocyclopentane

Gas phase thermochemistry data

Data compiled by: Hussein Y. Afeefy, Joel F. Liebman, and Stephen E. Stein
Quantity | Value | Units | Method | Reference | Comment |
---|---|---|---|---|---|
ΔfH°gas | -47.78 ± 0.75 | kJ/mol | Ccb | Berg, Scott, et al., 1961 |

Condensed phase thermochemistry data

Data compiled as indicated in comments:
ALS - Hussein Y. Afeefy, Joel F. Liebman, and Stephen E. Stein
DH - Eugene S. Domalski and Elizabeth D. Hearing
Quantity | Value | Units | Method | Reference | Comment |
---|---|---|---|---|---|
ΔfH°liquid | -89.33 ± 0.75 | kJ/mol | Ccb | Berg, Scott, et al., 1961 | ALS |
Quantity | Value | Units | Method | Reference | Comment |
ΔcH°liquid | -3909.5 ± 0.63 | kJ/mol | Ccb | Berg, Scott, et al., 1961 | Reanalyzed by Cox and Pilcher, 1970, Original value = -3908.9 ± 0.63 kJ/mol; ALS |
Quantity | Value | Units | Method | Reference | Comment |
S°liquid | 256.86 | J/mol*K | N/A | Berg, Scott, et al., 1961 | DH |
Constant pressure heat capacity of liquid
Cp,liquid (J/mol*K) | Temperature (K) | Reference | Comment |
---|---|---|---|
265.23 | 298.15 | Berg, Scott, et al., 1961 | T = 12 to 367 K. For metastable crystals 12 to 137 K.; DH |

Phase change data

Data compiled as indicated in comments:
BS - Robert L. Brown and Stephen E. Stein
TRC - Thermodynamics Research Center, NIST Boulder Laboratories, Chris Muzny director
ALS - Hussein Y. Afeefy, Joel F. Liebman, and Stephen E. Stein
DRB - Donald R. Burgess, Jr.
AC - William E. Acree, Jr., James S. Chickos
DH - Eugene S. Domalski and Elizabeth D. Hearing
Quantity | Value | Units | Method | Reference | Comment |
---|---|---|---|---|---|
Tboil | 404.7 | K | N/A | Weast and Grasselli, 1989 | BS |
Tboil | 405.33 | K | N/A | Majer and Svoboda, 1985 | |
Tboil | 405.35 | K | N/A | Lanum and Morris, 1969 | Uncertainty assigned by TRC = 0.2 K; TRC |
Quantity | Value | Units | Method | Reference | Comment |
Ttriple | 155.390 | K | N/A | Berg, Scott, et al., 1961, 2 | Uncertainty assigned by TRC = 0.06 K; TRC |
Quantity | Value | Units | Method | Reference | Comment |
Tc | 633.5 | K | N/A | Majer and Svoboda, 1985 | |
Quantity | Value | Units | Method | Reference | Comment |
ΔvapH° | 41.44 | kJ/mol | N/A | Majer and Svoboda, 1985 | |
ΔvapH° | 41.5 | kJ/mol | V | Berg, Scott, et al., 1961 | ALS |
ΔvapH° | 41.6 | kJ/mol | N/A | Berg, Scott, et al., 1961 | DRB |
Reduced pressure boiling point
Tboil (K) | Pressure (bar) | Reference | Comment |
---|---|---|---|
403.2 | 0.993 | Aldrich Chemical Company Inc., 1990 | BS |
Enthalpy of vaporization
ΔvapH (kJ/mol) | Temperature (K) | Method | Reference | Comment |
---|---|---|---|---|
35.32 | 405.33 | N/A | Majer and Svoboda, 1985 | |
38.2 | 369. | N/A | Dykyj, Svoboda, et al., 1999 | Based on data from 354. to 446. K.; AC |
38.4 | 363. | A,EB | Stephenson and Malanowski, 1987 | Based on data from 348. to 446. K. See also Berg, Scott, et al., 1961 and Osborn and Douslin, 1966.; AC |
37.9 ± 0.1 | 361. | C | Berg, Scott, et al., 1961 | AC |
36.7 ± 0.1 | 381. | C | Berg, Scott, et al., 1961 | AC |
35.3 ± 0.1 | 405. | C | Berg, Scott, et al., 1961 | AC |
Enthalpy of vaporization
ΔvapH =
A exp(-βTr) (1 − Tr)β
ΔvapH =
Enthalpy of vaporization (at saturation pressure)
(kJ/mol)
Tr = reduced temperature (T / Tc)
View plot Requires a JavaScript / HTML 5 canvas capable browser.
Temperature (K) | A (kJ/mol) | β | Tc (K) | Reference | Comment |
---|---|---|---|---|---|
361. to 405. | 56.91 | 0.2872 | 633.5 | Majer and Svoboda, 1985 |
Antoine Equation Parameters
log10(P) = A − (B / (T + C))
P = vapor pressure (bar)
T = temperature (K)
View plot Requires a JavaScript / HTML 5 canvas capable browser.
Temperature (K) | A | B | C | Reference | Comment |
---|---|---|---|---|---|
354.02 to 445.93 | 4.03754 | 1387.012 | -61.30 | Berg, Scott, et al., 1961 | Coefficents calculated by NIST from author's data. |
Enthalpy of fusion
ΔfusH (kJ/mol) | Temperature (K) | Reference | Comment |
---|---|---|---|
7.83 | 155.4 | Domalski and Hearing, 1996 | AC |
Enthalpy of phase transition
ΔHtrs (kJ/mol) | Temperature (K) | Initial Phase | Final Phase | Reference | Comment |
---|---|---|---|---|---|
7.8308 | 155.39 | crystaline, I | liquid | Berg, Scott, et al., 1961 | DH |
Entropy of phase transition
ΔStrs (J/mol*K) | Temperature (K) | Initial Phase | Final Phase | Reference | Comment |
---|---|---|---|---|---|
50.39 | 155.39 | crystaline, I | liquid | Berg, Scott, et al., 1961 | DH |

Van Den Dool and Kratz RI, polar column, custom temperature program

Column type | Active phase | I | Reference | Comment |
---|---|---|---|---|
Capillary | Supelcowax-10 | 1107. | Bianchi, Careri, et al., 2007 | 30. m/0.25 mm/0.25 μm, He; Program: 35C(8min) => 4C/min => 60C => 6C/min => 160C => 20C/min => 200C(1min) |
Capillary | Supelcowax-10 | 1111. | Bianchi, Careri, et al., 2007 | 30. m/0.25 mm/0.25 μm, He; Program: 40C(1min) => 10C/min => 120C => 15C/min => 200C (1min) |

Normal alkane RI, non-polar column, isothermal

Column type | Active phase | Temperature (C) | I | Reference | Comment |
---|---|---|---|---|---|
Capillary | DC-200 | 70. | 829. | Leppin, Gollnick, et al., 1969 | Argon; Column length: 100. m |

References

Berg, Scott, et al., 1961
Berg, W.T.; Scott, D.W.; Hubbard, W.N.; Todd, S.S.; Messerly, J.F.; Hossenlopp, I.A.; Osborn, A.; Douslin, D.R.; McCullough, J.P.,
The chemical thermodynamic properties of cyclopentanethiol,
J. Phys. Chem., 1961, 65, 1425-1430. [all data]
Cox and Pilcher, 1970
Cox, J.D.; Pilcher, G.,
Thermochemistry of Organic and Organometallic Compounds, Academic Press, New York, 1970, 1-636. [all data]
Weast and Grasselli, 1989
CRC Handbook of Data on Organic Compounds, 2nd Editon, Weast,R.C and Grasselli, J.G., ed(s)., CRC Press, Inc., Boca Raton, FL, 1989, 1. [all data]
Majer and Svoboda, 1985
Majer, V.; Svoboda, V.,
Enthalpies of Vaporization of Organic Compounds: A Critical Review and Data Compilation, Blackwell Scientific Publications, Oxford, 1985, 300. [all data]
Lanum and Morris, 1969
Lanum, W.J.; Morris, J.C.,
Physical Properties of Some Sulfur and Nitrogen Compounds,
J. Chem. Eng. Data, 1969, 14, 93-8. [all data]
Berg, Scott, et al., 1961, 2
Berg, W.T.; Scott, D.W.; Hubbard, W.N.; Todd, S.S.; Messerly, J.F.; Hossenlopp, I.A.; Osborn, A.G.; Douslin, D.R.; McCullough, J.P.,
The Chemical Thermodynamic Properties of Cyclopentanethiol,
J. Phys. Chem., 1961, 65, 1425-30. [all data]
Aldrich Chemical Company Inc., 1990
Aldrich Chemical Company Inc.,
Catalog Handbook of Fine Chemicals, Aldrich Chemical Company, Inc., Milwaukee WI, 1990, 1. [all data]
Dykyj, Svoboda, et al., 1999
Dykyj, J.; Svoboda, J.; Wilhoit, R.C.; Frenkel, M.L.; Hall, K.R.,
Vapor Pressure of Chemicals: Part A. Vapor Pressure and Antoine Constants for Hydrocarbons and Sulfur, Selenium, Tellurium and Hydrogen Containing Organic Compounds, Springer, Berlin, 1999, 373. [all data]
Stephenson and Malanowski, 1987
Stephenson, Richard M.; Malanowski, Stanislaw,
Handbook of the Thermodynamics of Organic Compounds, 1987, https://doi.org/10.1007/978-94-009-3173-2
. [all data]
Osborn and Douslin, 1966
Osborn, A.G.; Douslin, D.R.,
Vapor Pressure Relations of 36 Sulfur Compounds Present in Petroleum.,
J. Chem. Eng. Data, 1966, 11, 4, 502-509, https://doi.org/10.1021/je60031a014
. [all data]
Domalski and Hearing, 1996
Domalski, Eugene S.; Hearing, Elizabeth D.,
Heat Capacities and Entropies of Organic Compounds in the Condensed Phase. Volume III,
J. Phys. Chem. Ref. Data, 1996, 25, 1, 1, https://doi.org/10.1063/1.555985
. [all data]
Bianchi, Careri, et al., 2007
Bianchi, F.; Careri, M.; Mangia, A.; Musci, M.,
Retention indices in the analysis of food aroma volatile compounds in temperature-programmed gas chromatography: Database creation and evaluation of precision and robustness,
J. Sep. Sci., 2007, 39, 4, 563-572, https://doi.org/10.1002/jssc.200600393
. [all data]
Leppin, Gollnick, et al., 1969
Leppin, E.; Gollnick, K.; Schomburg, G.,
Gas chromatographic identification of isomeric mercaptans,
Chromatographia, 1969, 2, 12, 535-540, https://doi.org/10.1007/BF02260096
. [all data]