2-Hexanethiol
- Formula: C6H14S
- Molecular weight: 118.240
- IUPAC Standard InChIKey: ABNPJVOPTXYSQW-UHFFFAOYSA-N
- CAS Registry Number: 1679-06-7
- Chemical structure:
View 3d structure (requires JavaScript / HTML 5) - Other names: 2-Hexylthiol

Phase change data

Data compiled as indicated in comments:
TRC - Thermodynamics Research Center, NIST Boulder Laboratories, Chris Muzny director
AC - William E. Acree, Jr., James S. Chickos
Quantity | Value | Units | Method | Reference | Comment |
---|---|---|---|---|---|
Tboil | 412.25 | K | N/A | Lanum and Morris, 1969 | Uncertainty assigned by TRC = 0.2 K; TRC |
Tboil | 410. | K | N/A | Bordwell, Andersen, et al., 1954 | Uncertainty assigned by TRC = 6. K; TRC |
Quantity | Value | Units | Method | Reference | Comment |
Tfus | 126.2 | K | N/A | Ellis and Reid, 1932 | Uncertainty assigned by TRC = 0.4 K; TRC |
Enthalpy of vaporization
ΔvapH (kJ/mol) | Temperature (K) | Method | Reference | Comment |
---|---|---|---|---|
42.7 | 325. | N/A | Dykyj, Svoboda, et al., 1999 | Based on data from 310. to 440. K.; AC |
41.4 | 343. | A | Stephenson and Malanowski, 1987 | Based on data from 328. to 423. K.; AC |

Kovats' RI, non-polar column, custom temperature program

View large format table.

Column type Active phase I Reference Comment
CapillaryApiezon M883.Zhu, Wang, et al., 2007Program: not specified

Kovats' RI, polar column, isothermal

View large format table.

Column type Active phase Temperature (C) I Reference Comment
CapillaryPEG-20M93.1066.3Morishita, Murakita, et al., 1985Column length: 50. m; Column diameter: 0.25 mm
CapillaryPEG-20M80.1062.1Morishita, Murakita, et al., 1982N2; Column length: 50. m; Column diameter: 0.25 mm

Kovats' RI, polar column, custom temperature program

View large format table.

Column type Active phase I Reference Comment
CapillaryPEG-20M1095.Zhu, Wang, et al., 2007Program: not specified

Normal alkane RI, non-polar column, isothermal

View large format table.

Column type Active phase Temperature (C) I Reference Comment
CapillaryDC-20050.850.Leppin, Gollnick, et al., 1969Argon; Column length: 100. m

References

Lanum and Morris, 1969
Lanum, W.J.; Morris, J.C.,
Physical Properties of Some Sulfur and Nitrogen Compounds,
J. Chem. Eng. Data, 1969, 14, 93-8. [all data]
Bordwell, Andersen, et al., 1954
Bordwell, F.G.; Andersen, H.M.; Pitt, B.M.,
The Reaction of Thiacyclopropanes (Olefin Sulfes) and Thiacyclobutanes with Organolithium Compounds,
J. Am. Chem. Soc., 1954, 76, 1082. [all data]
Ellis and Reid, 1932
Ellis, L.M.; Reid, E.E.,
The Preparation and Properties of A Double Series of Aliphatic Mercaptans,
J. Am. Chem. Soc., 1932, 54, 1674. [all data]
Dykyj, Svoboda, et al., 1999
Dykyj, J.; Svoboda, J.; Wilhoit, R.C.; Frenkel, M.L.; Hall, K.R.,
Vapor Pressure of Chemicals: Part A. Vapor Pressure and Antoine Constants for Hydrocarbons and Sulfur, Selenium, Tellurium and Hydrogen Containing Organic Compounds, Springer, Berlin, 1999, 373. [all data]
Stephenson and Malanowski, 1987
Stephenson, Richard M.; Malanowski, Stanislaw,
Handbook of the Thermodynamics of Organic Compounds, 1987, https://doi.org/10.1007/978-94-009-3173-2
. [all data]