1,4-Diethylcyclohexane
- Formula: C10H20
- Molecular weight: 140.2658
- IUPAC Standard InChIKey: SMAKEJNOUFLEEJ-UHFFFAOYSA-N
- CAS Registry Number: 1679-00-1
- Chemical structure:
View 3d structure (requires JavaScript / HTML 5) - Species with the same structure:
- Stereoisomers:

Condensed phase thermochemistry data

Data compiled by: Eugene S. Domalski and Elizabeth D. Hearing
Constant pressure heat capacity of liquid
Cp,liquid (J/mol*K) | Temperature (K) | Reference | Comment |
---|---|---|---|
261.1 | 313. | Gudinowicz, Campbell, et al., 1963 | T = 313 to 423 K. 70% cis, 30% trans. |

Phase change data

Data compiled by: Thermodynamics Research Center, NIST Boulder Laboratories, Chris Muzny director
Quantity | Value | Units | Method | Reference | Comment |
---|---|---|---|---|---|
Tboil | 458.7 | K | N/A | Signaigo and Cramer, 1933 | Uncertainty assigned by TRC = 3. K |

References

Gudinowicz, Campbell, et al., 1963
Gudinowicz, B.J.; Campbell, R.H.; Adams, J.S.,
Specific heat measurements of complex saturated hydrocarbons,
J. Chem. Eng. Data, 1963, 8, 201-214. [all data]
Signaigo and Cramer, 1933
Signaigo, F.K.; Cramer, P.L.,
The preparation of some mono- and dialkylcylohexanes,
J. Am. Chem. Soc., 1933, 55, 3326-32. [all data]